program: Orca
programVersion: 5.0.2
elementType: H C C C C C C H C O F F F H C C C C H C H H O N F C C H C H C C C H H C H N H
charge: 0
multiplicity: 1
keywords: wb97x-d3
keywords: def2-TZVPP
keywords: def2/J RIJCOSX
keywords: DEFGRID2
keywords: scfconv7
keywords: smallprint printgap noloewdin
keywords: NOSOSCF
formula: C19H12F4N2O2
InChI: InChI=1/C19H12F4N2O2/c20-13-7-9-14(10-8-13)24-18(26)16-5-2-6-17(25-16)27-15-4-1-3-12(11-15)19(21,22)23/h1-11,24H
39 atoms
H  1.901823 0.722313 1.417031
C  2.040339 1.290549 0.507466
C  1.338004 2.463987 0.281769
C  0.303707 2.908785 1.267537
C  1.534012 3.199175 -0.88319
C  2.449469 2.753084 -1.820432
C  3.146645 1.569994 -1.618554
H  3.852561 1.213155 -2.357243
C  2.932534 0.848835 -0.458576
O  3.675524 -0.29745 -0.272997
F  -0.91857 2.482692 0.912087
F  0.233435 4.241006 1.359089
F  0.527562 2.442347 2.499875
H  2.61508 3.324203 -2.723443
C  1.125592 -2.693723 0.052885
C  3.044053 -1.478021 -0.0703
C  3.839799 -2.58356 0.233818
C  3.1954 -3.782936 0.442679
H  3.769846 -4.667401 0.681673
C  1.805325 -3.853391 0.360811
H  1.285637 -4.782462 0.541958
H  0.986348 4.113828 -1.065883
O  -1.026334 -3.691707 0.167856
N  -0.879443 -1.450413 -0.245785
F  -6.045381 0.378403 -0.779242
C  -4.79263 -0.088349 -0.643278
C  -3.736612 0.681343 -1.089632
H  -3.908266 1.648872 -1.542437
C  -2.450782 0.190419 -0.950771
H  -1.617376 0.783644 -1.30639
C  -2.215672 -1.056059 -0.368465
C  -3.2994 -1.809235 0.081124
C  -4.59128 -1.321606 -0.060571
H  -5.430776 -1.907367 0.290111
H  4.915035 -2.494396 0.303418
C  -0.37251 -2.673484 -0.00735
H  -0.185962 -0.728226 -0.406967
N  1.744339 -1.535957 -0.17433
H  -3.161285 -2.768629 0.552005
elementType: H C O F N
totalener: -1390.77003852 hartree
nucrepener: 2430.21899004 hartree
electener: -3820.98902857 hartree
oneelecener: -6736.58941095 hartree
twoeener: 2915.60038238 hartree
cpcmener: -0.03254380 hartree
kineticenergy: 1385.46508080 hartree
xcener: -125.944465630968 hartree
chargesum: -0.0000000
charge: 0.139456 -0.185552 -0.011471 0.559048 -0.196128 -0.114622 -0.216920 0.152368 0.289254 -0.315379 -0.177677 -0.182733 -0.182586 0.164849 0.209715 0.393457 -0.223137 -0.077459 0.167395 -0.177074 0.144802 0.151735 -0.535337 -0.130355 -0.227466 0.250716 -0.132838 0.153569 -0.269222 0.147203 0.223576 -0.236698 -0.162053 0.153334 0.156085 0.358034 0.191935 -0.405960 0.154134
qa: 0.1395 -0.1856 -0.0115 0.5590 -0.1961 -0.1146 -0.2169 0.1524 0.2893 -0.3154 -0.1777 -0.1827 -0.1826 0.1648 0.2097 0.3935 -0.2231 -0.0775 0.1674 -0.1771 0.1448 0.1517 -0.5353 -0.1304 -0.2275 0.2507 -0.1328 0.1536 -0.2692 0.1472 0.2236 -0.2367 -0.1621 0.1533 0.1561 0.3580 0.1919 -0.4060 0.1541
va: 1.0280 3.9509 3.6146 4.4019 3.9907 3.8857 4.0551 1.0015 3.7125 2.1163 1.0987 1.1178 1.1194 0.9864 3.7171 3.9040 3.9728 3.9393 0.9877 3.9817 1.0217 1.0076 1.9753 3.2512 1.0470 3.9445 3.8557 0.9956 3.9236 1.0087 3.7183 3.9477 3.8917 0.9971 1.0008 4.1760 1.0229 3.0096 1.0320
dispcorr: -0.018909679 hartree
energy: -1390.788948203982
dipole: 10.39583 -7.46056 2.93527 -14.21567 14.74931 0.53363 -9.08516 8.21593 -0.86924
magnitude: 3.10743 au
magnitude: 7.89847 debye
