program: Orca
programVersion: 5.0.2
elementType: H C C C C C C H C O F F F H C C C C H C H H O N F C C H C H C C C H H C H N H
charge: 0
multiplicity: 1
keywords: wb97x-d3
keywords: def2-TZVPP
keywords: def2/J RIJCOSX
keywords: DEFGRID2
keywords: scfconv7
keywords: smallprint printgap noloewdin
keywords: NOSOSCF
formula: C19H12F4N2O2
InChI: InChI=1/C19H12F4N2O2/c20-13-7-9-14(10-8-13)24-18(26)16-5-2-6-17(25-16)27-15-4-1-3-12(11-15)19(21,22)23/h1-11,24H
39 atoms
H  2.09054 1.923175 -0.881822
C  2.477171 2.287028 0.061674
C  3.448093 3.275931 0.113732
C  4.000525 3.879878 -1.1408
C  3.91236 3.753798 1.335638
C  3.406118 3.226237 2.510454
C  2.447535 2.223784 2.47747
H  2.051959 1.806495 3.394166
C  1.990653 1.768069 1.25411
O  0.977367 0.837711 1.25981
F  5.340127 3.872453 -1.139831
F  3.628319 5.160518 -1.277861
F  3.608229 3.240325 -2.244899
H  3.762055 3.593484 3.462837
C  -0.064395 -2.075176 -0.302077
C  1.096658 -0.330443 0.582046
C  2.324279 -0.88745 0.226011
C  2.300937 -2.094475 -0.442291
H  3.230467 -2.561706 -0.737188
C  1.087121 -2.709628 -0.725822
H  1.050211 -3.653693 -1.248483
H  4.662416 4.532728 1.37999
O  -1.491668 -3.746661 -1.193567
N  -2.429625 -2.034717 -0.01071
F  -7.848859 -2.997841 0.171566
C  -6.524518 -2.779644 0.111256
C  -5.737208 -3.616791 -0.649757
H  -6.179724 -4.439823 -1.195383
C  -4.367413 -3.401082 -0.714939
H  -3.771202 -4.065127 -1.317998
C  -3.79391 -2.340774 -0.013104
C  -4.618625 -1.507554 0.745506
C  -5.983613 -1.719381 0.811522
H  -6.611815 -1.06675 1.403225
H  3.262462 -0.406929 0.465532
C  -1.400862 -2.708478 -0.553563
H  -2.167806 -1.194462 0.49162
N  -0.05479 -0.906922 0.336067
H  -4.185937 -0.679139 1.293197
elementType: H C O F N
totalener: -1390.77025537 hartree
nucrepener: 2246.04951394 hartree
electener: -3636.81976931 hartree
oneelecener: -6368.01542848 hartree
twoeener: 2731.19565917 hartree
cpcmener: -0.03416466 hartree
kineticenergy: 1385.43713637 hartree
xcener: -125.938444427357 hartree
chargesum: 0.0000000
charge: 0.158777 -0.149412 -0.028325 0.563212 -0.185813 -0.128578 -0.196670 0.153246 0.227431 -0.311701 -0.184401 -0.183939 -0.180696 0.163880 0.230403 0.325651 -0.182760 -0.108064 0.167134 -0.159406 0.145109 0.153445 -0.535181 -0.121723 -0.227458 0.250856 -0.170449 0.152777 -0.232892 0.156581 0.204812 -0.238053 -0.144221 0.154049 0.162641 0.359581 0.181372 -0.388537 0.147323
qa: 0.1588 -0.1494 -0.0283 0.5632 -0.1858 -0.1286 -0.1967 0.1532 0.2274 -0.3117 -0.1844 -0.1839 -0.1807 0.1639 0.2304 0.3257 -0.1828 -0.1081 0.1671 -0.1594 0.1451 0.1534 -0.5352 -0.1217 -0.2275 0.2509 -0.1704 0.1528 -0.2329 0.1566 0.2048 -0.2381 -0.1442 0.1540 0.1626 0.3596 0.1814 -0.3885 0.1473
va: 1.0095 3.9625 3.6642 4.4153 4.0010 3.9056 4.0267 1.0024 3.7831 2.0758 1.1122 1.1094 1.1228 0.9874 3.6630 4.0820 3.8977 3.9539 0.9913 3.9729 1.0213 1.0059 1.9755 3.2622 1.0470 3.9388 3.8956 0.9975 3.9301 1.0368 3.7693 3.9279 3.8608 0.9952 0.9913 4.1995 1.0362 3.0105 1.0061
dispcorr: -0.016185688 hartree
energy: -1390.786441055758
dipole: -6.95251 9.02735 2.07483 -14.74472 15.89430 1.14958 10.36864 -8.60597 1.76267
magnitude: 2.95525 au
magnitude: 7.51164 debye
