program: Orca
programVersion: 5.0.2
elementType: H C C C C C C H C O F F F H C C C C H C H H O N F C C H C H C C C H H C H N H
charge: 0
multiplicity: 1
keywords: wb97x-d3
keywords: def2-TZVPP
keywords: def2/J RIJCOSX
keywords: DEFGRID2
keywords: scfconv7
keywords: smallprint printgap noloewdin
keywords: NOSOSCF
formula: C19H12F4N2O2
InChI: InChI=1/C19H12F4N2O2/c20-13-7-9-14(10-8-13)24-18(26)16-5-2-6-17(25-16)27-15-4-1-3-12(11-15)19(21,22)23/h1-11,24H
39 atoms
H  3.176998 1.901027 -0.772369
C  2.421016 1.884677 0.001956
C  1.62022 2.988533 0.264697
C  1.794996 4.262956 -0.504353
C  0.65442 2.935987 1.262705
C  0.504209 1.775222 2.005281
C  1.30338 0.668991 1.763273
H  1.185089 -0.226329 2.35905
C  2.255162 0.73484 0.75663
O  3.122267 -0.300673 0.508042
F  2.579995 4.119677 -1.575201
F  2.340558 5.226832 0.252239
F  0.623108 4.741305 -0.941727
H  -0.243884 1.72981 2.785446
C  0.928155 -2.930075 -0.270894
C  2.656819 -1.533072 0.212755
C  3.595586 -2.562722 0.121814
C  3.124262 -3.819341 -0.189283
H  3.814309 -4.648584 -0.270048
C  1.760013 -4.023862 -0.389085
H  1.370154 -5.004688 -0.618816
H  0.01941 3.786979 1.47238
O  -1.059527 -4.151344 -0.717031
N  -1.221545 -1.921624 -0.239298
F  -6.570499 -0.629481 -0.214441
C  -5.270319 -0.966024 -0.231015
C  -4.318662 0.016426 -0.04033
H  -4.609412 1.046927 0.116849
C  -2.983317 -0.341417 -0.053166
H  -2.231085 0.424189 0.097641
C  -2.59343 -1.667292 -0.257226
C  -3.575141 -2.639223 -0.450792
C  -4.916321 -2.282469 -0.435862
H  -5.677278 -3.03839 -0.581081
H  4.646915 -2.372762 0.289901
C  -0.556131 -3.074413 -0.441488
H  -0.62749 -1.12593 -0.033002
N  1.378774 -1.708864 0.014507
H  -3.316787 -3.6736 -0.607673
elementType: H C O F N
totalener: -1390.77992033 hartree
nucrepener: 2342.27618813 hartree
electener: -3733.05610846 hartree
oneelecener: -6560.24101537 hartree
twoeener: 2827.18490691 hartree
cpcmener: -0.02670946 hartree
kineticenergy: 1385.45972902 hartree
xcener: -125.942973898446 hartree
chargesum: 0.0000000
charge: 0.141620 -0.207337 -0.016519 0.560639 -0.178906 -0.143555 -0.190027 0.146696 0.297187 -0.305829 -0.180230 -0.182392 -0.183228 0.162557 0.223057 0.390345 -0.220654 -0.078260 0.163948 -0.177949 0.146269 0.150742 -0.503694 -0.130399 -0.225696 0.249518 -0.146150 0.150034 -0.244968 0.143515 0.216538 -0.230441 -0.166018 0.149530 0.153640 0.335248 0.185567 -0.409902 0.155504
qa: 0.1416 -0.2073 -0.0165 0.5606 -0.1789 -0.1436 -0.1900 0.1467 0.2972 -0.3058 -0.1802 -0.1824 -0.1832 0.1626 0.2231 0.3903 -0.2207 -0.0783 0.1639 -0.1779 0.1463 0.1507 -0.5037 -0.1304 -0.2257 0.2495 -0.1461 0.1500 -0.2450 0.1435 0.2165 -0.2304 -0.1660 0.1495 0.1536 0.3352 0.1856 -0.4099 0.1555
va: 1.0224 4.0956 3.6754 4.4146 4.0011 3.8679 3.9255 1.0075 3.7150 2.1269 1.1230 1.1097 1.1145 0.9893 3.7139 3.9131 3.9728 3.9385 0.9892 3.9817 1.0219 1.0076 2.0164 3.2554 1.0495 3.9448 3.8734 0.9967 3.9337 1.0050 3.7710 3.9310 3.8956 0.9986 1.0017 4.2006 1.0283 3.0173 1.0386
dispcorr: -0.017714960 hartree
energy: -1390.797635293973
dipole: -1.23560 2.93214 1.69654 -22.96999 22.80260 -0.16739 6.50654 -5.31857 1.18796
magnitude: 2.07787 au
magnitude: 5.28152 debye
