program: Orca
programVersion: 5.0.2
elementType: H C C C C C C H C O F F F H C C C C H C H H O N F C C H C H C C C H H C H N H
charge: 0
multiplicity: 1
keywords: wb97x-d3
keywords: def2-TZVPP
keywords: def2/J RIJCOSX
keywords: DEFGRID2
keywords: scfconv7
keywords: smallprint printgap noloewdin
keywords: NOSOSCF
formula: C19H12F4N2O2
InChI: InChI=1/C19H12F4N2O2/c20-13-7-9-14(10-8-13)24-18(26)16-5-2-6-17(25-16)27-15-4-1-3-12(11-15)19(21,22)23/h1-11,24H
39 atoms
H  2.924468 1.730622 1.577668
C  2.348311 1.854475 0.66952
C  1.60913 3.006057 0.425866
C  1.58103 4.088709 1.458973
C  0.869295 3.134391 -0.74101
C  0.893628 2.11139 -1.678179
C  1.642465 0.96699 -1.459894
H  1.673207 0.184945 -2.206989
C  2.360293 0.848266 -0.2786
O  3.175965 -0.228497 -0.033752
F  2.727952 4.15963 2.143644
F  0.606221 3.890651 2.358548
F  1.369512 5.29456 0.922594
H  0.329563 2.212686 -2.59546
C  0.900782 -2.903175 0.019747
C  2.669517 -1.476919 0.035127
C  3.585766 -2.515984 0.213447
C  3.080999 -3.793916 0.301333
H  3.751997 -4.630473 0.443115
C  1.707592 -4.007393 0.200133
H  1.292421 -5.002698 0.257502
H  0.284276 4.02204 -0.940021
O  -1.094243 -4.178706 -0.077738
N  -1.241094 -1.910179 -0.2999
F  -6.579758 -0.743522 -0.991979
C  -5.282269 -1.048491 -0.822402
C  -4.896502 -2.371579 -0.807782
H  -5.629268 -3.158167 -0.933889
C  -3.558504 -2.695605 -0.632039
H  -3.276469 -3.73534 -0.627946
C  -2.609379 -1.685516 -0.471331
C  -3.030504 -0.353958 -0.493923
C  -4.363776 -0.028668 -0.669188
H  -4.678201 1.006762 -0.683834
H  4.646161 -2.31462 0.281617
C  -0.583535 -3.071615 -0.120699
H  -0.653338 -1.083967 -0.289413
N  1.379445 -1.66068 -0.051219
H  -2.305963 0.442963 -0.372775
elementType: H C O F N
totalener: -1390.78027855 hartree
nucrepener: 2338.54249094 hartree
electener: -3729.32276949 hartree
oneelecener: -6552.86717726 hartree
twoeener: 2823.54440777 hartree
cpcmener: -0.02665002 hartree
kineticenergy: 1385.46856949 hartree
xcener: -125.944153334291 hartree
chargesum: -0.0000000
charge: 0.140275 -0.213189 -0.009549 0.557002 -0.169907 -0.133368 -0.196754 0.147709 0.288874 -0.307098 -0.181946 -0.181508 -0.181239 0.162667 0.215962 0.389423 -0.216877 -0.082380 0.163822 -0.171715 0.145887 0.151966 -0.503288 -0.130195 -0.225843 0.249505 -0.166493 0.149501 -0.227124 0.155996 0.211334 -0.244232 -0.143677 0.150598 0.153772 0.337792 0.183678 -0.411381 0.141997
qa: 0.1403 -0.2132 -0.0095 0.5570 -0.1699 -0.1334 -0.1968 0.1477 0.2889 -0.3071 -0.1819 -0.1815 -0.1812 0.1627 0.2160 0.3894 -0.2169 -0.0824 0.1638 -0.1717 0.1459 0.1520 -0.5033 -0.1302 -0.2258 0.2495 -0.1665 0.1495 -0.2271 0.1560 0.2113 -0.2442 -0.1437 0.1506 0.1538 0.3378 0.1837 -0.4114 0.1420
va: 1.0239 4.1355 3.6661 4.4169 3.9771 3.8764 3.9436 1.0063 3.7154 2.1248 1.1189 1.1069 1.1198 0.9892 3.7264 3.9095 3.9716 3.9427 0.9894 3.9748 1.0229 1.0078 2.0152 3.2600 1.0496 3.9466 3.8948 0.9986 3.9288 1.0378 3.7742 3.9361 3.8693 0.9964 1.0019 4.1956 1.0273 3.0188 1.0066
dispcorr: -0.017424224 hartree
energy: -1390.797702776440
dipole: 0.53220 1.33754 1.86974 -21.22625 21.33411 0.10786 -10.08912 9.19569 -0.89343
magnitude: 2.07503 au
magnitude: 5.27432 debye
