program: Orca
programVersion: 5.0.2
elementType: H C C C C C C H C O F F F H C C C C H C H H O N F C C H C H C C C H H C H N H
charge: 0
multiplicity: 1
keywords: wb97x-d3
keywords: def2-TZVPP
keywords: def2/J RIJCOSX
keywords: DEFGRID2
keywords: scfconv7
keywords: smallprint printgap noloewdin
keywords: NOSOSCF
formula: C19H12F4N2O2
InChI: InChI=1/C19H12F4N2O2/c20-13-7-9-14(10-8-13)24-18(26)16-5-2-6-17(25-16)27-15-4-1-3-12(11-15)19(21,22)23/h1-11,24H
39 atoms
H  3.075344 1.833964 1.633081
C  2.407326 1.924289 0.786026
C  1.703287 3.095069 0.536003
C  1.927328 4.294478 1.403208
C  0.848325 3.185769 -0.553835
C  0.719823 2.099504 -1.405584
C  1.432725 0.932061 -1.185191
H  1.341906 0.107704 -1.878319
C  2.265277 0.85027 -0.076908
O  3.056333 -0.238272 0.184229
F  2.880462 5.090261 0.895146
F  2.320021 3.968364 2.638085
F  0.826655 5.043673 1.524944
H  0.062472 2.165735 -2.262056
C  0.85086 -2.967008 -0.004375
C  2.580522 -1.500195 0.151842
C  3.520354 -2.52638 0.270817
C  3.048341 -3.819939 0.251873
H  3.739466 -4.647306 0.341582
C  1.683306 -4.06109 0.106462
H  1.293262 -5.067858 0.074242
H  0.290138 4.090223 -0.754898
O  -1.124189 -4.263184 -0.228228
N  -1.286847 -1.986129 -0.34507
F  -6.585142 -0.765247 -1.206652
C  -5.296794 -1.085197 -0.998816
C  -4.925578 -2.412471 -0.979768
H  -5.663157 -3.189415 -1.13436
C  -3.59753 -2.751696 -0.761165
H  -3.324479 -3.794101 -0.751307
C  -2.645301 -1.751476 -0.563545
C  -3.051635 -0.415224 -0.591978
C  -4.374374 -0.075024 -0.809142
H  -4.678076 0.963575 -0.827959
H  4.573599 -2.30298 0.37308
C  -0.625846 -3.15017 -0.199231
H  -0.70175 -1.160961 -0.272961
N  1.298335 -1.712129 0.031115
H  -2.322534 0.372586 -0.440971
elementType: H C O F N
totalener: -1390.77932434 hartree
nucrepener: 2327.47591337 hartree
electener: -3718.25523771 hartree
oneelecener: -6530.57234309 hartree
twoeener: 2812.31710538 hartree
cpcmener: -0.02662128 hartree
kineticenergy: 1385.47262462 hartree
xcener: -125.945946593687 hartree
chargesum: -0.0000000
charge: 0.139729 -0.227040 -0.004935 0.555786 -0.173795 -0.142646 -0.199900 0.146764 0.303424 -0.300236 -0.181728 -0.181208 -0.181446 0.162989 0.223503 0.396839 -0.221734 -0.080009 0.164006 -0.174168 0.146197 0.151421 -0.503395 -0.131509 -0.225856 0.249515 -0.165875 0.149586 -0.229649 0.155463 0.214897 -0.244858 -0.145934 0.150116 0.153479 0.334137 0.186563 -0.412991 0.144498
qa: 0.1397 -0.2270 -0.0049 0.5558 -0.1738 -0.1426 -0.1999 0.1468 0.3034 -0.3002 -0.1817 -0.1812 -0.1814 0.1630 0.2235 0.3968 -0.2217 -0.0800 0.1640 -0.1742 0.1462 0.1514 -0.5034 -0.1315 -0.2259 0.2495 -0.1659 0.1496 -0.2296 0.1555 0.2149 -0.2449 -0.1459 0.1501 0.1535 0.3341 0.1866 -0.4130 0.1445
va: 1.0254 4.1142 3.6724 4.4180 3.9968 3.8744 3.9129 1.0106 3.7222 2.1345 1.1060 1.1204 1.1191 0.9898 3.7126 3.9082 3.9723 3.9391 0.9893 3.9811 1.0222 1.0081 2.0163 3.2562 1.0495 3.9454 3.8955 0.9986 3.9309 1.0386 3.7733 3.9341 3.8737 0.9968 1.0021 4.2009 1.0266 3.0112 1.0049
dispcorr: -0.017526666 hartree
energy: -1390.796851005608
dipole: -1.62044 3.33279 1.71235 -22.35775 22.33413 -0.02361 -9.23997 8.52715 -0.71282
magnitude: 1.85494 au
magnitude: 4.71489 debye
