program: Orca
programVersion: 5.0.2
elementType: H C C C C C C H C O F F F H C C C C H C H H O N F C C H C H C C C H H C H N H
charge: 0
multiplicity: 1
keywords: wb97x-d3
keywords: def2-TZVPP
keywords: def2/J RIJCOSX
keywords: DEFGRID2
keywords: scfconv7
keywords: smallprint printgap noloewdin
keywords: NOSOSCF
formula: C19H12F4N2O2
InChI: InChI=1/C19H12F4N2O2/c20-13-7-9-14(10-8-13)24-18(26)16-5-2-6-17(25-16)27-15-4-1-3-12(11-15)19(21,22)23/h1-11,24H
39 atoms
H  1.875561 0.714648 1.362421
C  2.054287 1.302572 0.472367
C  1.404738 2.51152 0.273122
C  0.371424 2.962938 1.257906
C  1.651286 3.274668 -0.86338
C  2.56154 2.818525 -1.801325
C  3.205427 1.602576 -1.626383
H  3.911518 1.241222 -2.363149
C  2.945461 0.854059 -0.491809
O  3.653954 -0.310181 -0.332604
F  -0.85306 2.547374 0.897332
F  0.313279 4.294897 1.353524
F  0.588591 2.490075 2.489162
H  2.767564 3.411205 -2.68231
C  1.099556 -2.684489 0.083822
C  3.018267 -1.477467 -0.094362
C  3.816403 -2.582944 0.205298
C  3.173377 -3.777429 0.443912
H  3.750056 -4.661043 0.682474
C  1.782358 -3.84319 0.391388
H  1.259419 -4.766828 0.591678
H  1.147406 4.218245 -1.024316
O  -1.040999 -3.691572 0.252485
N  -0.921053 -1.464063 -0.235626
F  -6.117456 0.273137 -0.79632
C  -4.85698 -0.169995 -0.652247
C  -3.811011 0.627613 -1.072356
H  -3.997107 1.598933 -1.511774
C  -2.516912 0.16136 -0.924425
H  -1.69279 0.77896 -1.260291
C  -2.261934 -1.089826 -0.359808
C  -3.336949 -1.871789 0.063609
C  -4.636307 -1.407572 -0.08611
H  -5.467932 -2.016518 0.244196
H  4.893478 -2.495568 0.248482
C  -0.400762 -2.675356 0.040338
H  -0.235988 -0.739412 -0.418676
N  1.715454 -1.529899 -0.165455
H  -3.183634 -2.837326 0.517057
elementType: H C O F N
totalener: -1390.77977370 hartree
nucrepener: 2419.95534450 hartree
electener: -3810.73511820 hartree
oneelecener: -6716.04415625 hartree
twoeener: 2905.30903805 hartree
cpcmener: -0.02676973 hartree
kineticenergy: 1385.47094536 hartree
xcener: -125.944811568687 hartree
chargesum: 0.0000000
charge: 0.136928 -0.189435 -0.013911 0.556568 -0.189965 -0.112405 -0.218676 0.149256 0.289636 -0.305207 -0.177376 -0.181141 -0.181494 0.161458 0.216626 0.389500 -0.223258 -0.077928 0.163961 -0.176480 0.145933 0.150394 -0.501452 -0.133236 -0.225932 0.248042 -0.134614 0.150223 -0.260534 0.140939 0.222532 -0.231926 -0.160735 0.150303 0.153596 0.336764 0.186053 -0.407025 0.154023
qa: 0.1369 -0.1894 -0.0139 0.5566 -0.1900 -0.1124 -0.2187 0.1493 0.2896 -0.3052 -0.1774 -0.1811 -0.1815 0.1615 0.2166 0.3895 -0.2233 -0.0779 0.1640 -0.1765 0.1459 0.1504 -0.5015 -0.1332 -0.2259 0.2480 -0.1346 0.1502 -0.2605 0.1409 0.2225 -0.2319 -0.1607 0.1503 0.1536 0.3368 0.1861 -0.4070 0.1540
va: 1.0303 3.9519 3.6345 4.4051 3.9945 3.8927 4.0522 1.0033 3.7280 2.1279 1.1007 1.1199 1.1206 0.9879 3.7085 3.9174 3.9713 3.9386 0.9891 3.9825 1.0221 1.0081 2.0167 3.2525 1.0494 3.9511 3.8641 0.9967 3.9292 1.0119 3.7412 3.9442 3.8915 0.9981 1.0018 4.2043 1.0264 3.0078 1.0347
dispcorr: -0.018533391 hartree
energy: -1390.798307093452
dipole: 10.26302 -7.40160 2.86141 -14.29247 14.72235 0.42988 -9.03396 8.15877 -0.87519
magnitude: 3.02298 au
magnitude: 7.68382 debye
