program: Orca
programVersion: 5.0.2
elementType: H C C C C C C H C O F F F H C C C C H C H H O N F C C H C H C C C H H C H N H
charge: 0
multiplicity: 1
keywords: wb97x-d3
keywords: def2-TZVPP
keywords: def2/J RIJCOSX
keywords: DEFGRID2
keywords: scfconv7
keywords: smallprint printgap noloewdin
keywords: NOSOSCF
formula: C19H12F4N2O2
InChI: InChI=1/C19H12F4N2O2/c20-13-7-9-14(10-8-13)24-18(26)16-5-2-6-17(25-16)27-15-4-1-3-12(11-15)19(21,22)23/h1-11,24H
39 atoms
H  3.003435 1.844192 1.697645
C  2.394814 1.937734 0.807834
C  1.72618 3.118298 0.510702
C  1.915502 4.31368 1.397889
C  0.945468 3.211675 -0.631567
C  0.855034 2.121938 -1.48431
C  1.533761 0.946512 -1.213025
H  1.472666 0.116408 -1.902156
C  2.296505 0.859719 -0.055133
O  3.056919 -0.234851 0.253696
F  3.028779 4.981618 1.072146
F  2.029486 3.971676 2.68482
F  0.899175 5.174162 1.300397
H  0.256511 2.192968 -2.382337
C  0.841338 -2.946197 -0.049022
C  2.574852 -1.491588 0.178478
C  3.504781 -2.526123 0.298562
C  3.026639 -3.817296 0.238946
H  3.712129 -4.649443 0.326761
C  1.666316 -4.047556 0.057036
H  1.25641 -5.04443 -0.004772
H  0.414414 4.122367 -0.869121
O  -1.1122 -4.247344 -0.355756
N  -1.309786 -1.966478 -0.344379
F  -6.645034 -0.853564 -1.117902
C  -5.351156 -1.143088 -0.932451
C  -4.936644 -2.458011 -0.969212
H  -5.654736 -3.246822 -1.148652
C  -3.599537 -2.768879 -0.775027
H  -3.28665 -3.799426 -0.802893
C  -2.674634 -1.75047 -0.544347
C  -3.119773 -0.428454 -0.514542
C  -4.453898 -0.118146 -0.706711
H  -4.79143 0.908862 -0.677974
H  4.555013 -2.308094 0.431116
C  -0.635364 -3.136353 -0.264379
H  -0.732744 -1.14449 -0.224434
N  1.293813 -1.694916 0.018422
H  -2.414366 0.374697 -0.334074
totalener: -1390.75998302 hartree
nucrepener: 2323.61325456 hartree
electener: -3714.37323758 hartree
oneelecener: -6522.71920356 hartree
twoeener: 2808.34596597 hartree
kineticenergy: 1385.49327253 hartree
xcener: -125.946364722964 hartree
chargesum: 0.0000000
charge: 0.127414 -0.217984 -0.012819 0.544147 -0.150674 -0.115634 -0.204404 0.127102 0.303129 -0.282238 -0.167071 -0.172567 -0.172442 0.137727 0.195376 0.358136 -0.204993 -0.059196 0.136871 -0.151920 0.145513 0.135515 -0.410239 -0.151073 -0.205487 0.233384 -0.138236 0.124177 -0.185153 0.153627 0.205745 -0.220794 -0.128473 0.122686 0.135660 0.303663 0.158192 -0.400834 0.104166
qa: 0.1274 -0.2180 -0.0128 0.5441 -0.1507 -0.1156 -0.2044 0.1271 0.3031 -0.2822 -0.1671 -0.1726 -0.1724 0.1377 0.1954 0.3581 -0.2050 -0.0592 0.1369 -0.1519 0.1455 0.1355 -0.4102 -0.1511 -0.2055 0.2334 -0.1382 0.1242 -0.1852 0.1536 0.2057 -0.2208 -0.1285 0.1227 0.1357 0.3037 0.1582 -0.4008 0.1042
va: 1.0295 4.1430 3.7621 4.4325 4.0150 3.9089 3.9641 1.0166 3.7790 2.1542 1.1274 1.1320 1.1324 0.9991 3.7810 3.9854 3.9903 3.9298 0.9990 4.0028 1.0234 1.0144 2.1047 3.2574 1.0801 4.0174 3.8926 1.0066 3.9522 1.0387 3.8649 3.9718 3.9176 1.0059 1.0088 4.2266 1.0469 3.0040 1.0159
dispcorr: -0.017259281 hartree
energy: -1390.777242303718
dipole: -1.36071 2.70643 1.34571 -22.29805 22.05561 -0.24245 -9.31827 8.85311 -0.46516
magnitude: 1.44433 au
magnitude: 3.67120 debye
