program: Orca
programVersion: 5.0.2
elementType: H C C C C C C H C F F F H H N C C Cl C C N O H N H C H H H
charge: 0
multiplicity: 1
keywords: wb97x-d3
keywords: def2-TZVPP
keywords: def2/J RIJCOSX
keywords: DEFGRID2
keywords: scfconv7
keywords: smallprint printgap noloewdin
keywords: NOSOSCF
formula: C12H9ClF3N3O
InChI: InChI=1/C12H9ClF3N3O/c1-17-9-6-18-19(11(20)10(9)13)8-4-2-3-7(5-8)12(14,15)16/h2-6,17H,1H3
29 atoms
H  4.297671 1.879573 -0.64343
C  3.28406 1.512585 -0.559766
C  3.009118 0.283597 0.025467
C  4.126742 -0.584435 0.516223
C  1.699506 -0.167473 0.130075
C  0.66884 0.615862 -0.362859
C  0.93266 1.83985 -0.960965
H  0.131043 2.439538 -1.369013
C  2.241145 2.283642 -1.050109
F  4.521954 -1.462385 -0.418166
F  3.778498 -1.304656 1.588516
F  5.206139 0.128037 0.854339
H  2.45076 3.23857 -1.511707
H  1.471382 -1.119394 0.59123
N  -0.668055 0.135086 -0.264334
C  -1.637906 0.905295 0.377225
C  -2.923429 0.296691 0.418057
Cl -4.180455 1.202253 1.168309
C  -3.167852 -0.967253 -0.077047
C  -2.02952 -1.620258 -0.663415
N  -0.86387 -1.085958 -0.743297
O  -1.356447 1.999916 0.85645
H  -2.110585 -2.614819 -1.078343
N  -4.353279 -1.576178 -0.037492
H  -5.116385 -1.100006 0.416054
C  -4.599337 -2.923289 -0.502415
H  -5.650258 -3.144304 -0.345545
H  -4.01305 -3.660869 0.046999
H  -4.389784 -3.030594 -1.566616
elementType: H C F N Cl O
totalener: -1462.04174025 hartree
nucrepener: 1665.44166238 hartree
electener: -3127.48340263 hartree
oneelecener: -5318.52347226 hartree
twoeener: 2191.04006962 hartree
cpcmener: -0.03915483 hartree
kineticenergy: 1457.59832151 hartree
xcener: -111.244334927937 hartree
chargesum: 0.0000000
charge: 0.153879 -0.146240 -0.015932 0.553361 -0.181219 0.157588 -0.209924 0.156529 -0.118762 -0.182910 -0.183025 -0.181675 0.165240 0.140489 0.104993 0.331719 -0.116372 -0.093728 0.214423 -0.050221 -0.253756 -0.561475 0.136635 -0.169828 0.163185 -0.179014 0.119665 0.124933 0.121443
qa: 0.1539 -0.1462 -0.0159 0.5534 -0.1812 0.1576 -0.2099 0.1565 -0.1188 -0.1829 -0.1830 -0.1817 0.1652 0.1405 0.1050 0.3317 -0.1164 -0.0937 0.2144 -0.0502 -0.2538 -0.5615 0.1366 -0.1698 0.1632 -0.1790 0.1197 0.1249 0.1214
va: 1.0061 3.9701 3.7021 4.4212 4.1262 3.6863 4.0329 1.0086 3.9166 1.1048 1.1175 1.1194 0.9890 1.0316 3.1590 4.3301 3.7370 1.2453 3.8657 4.0632 2.9538 1.9542 1.0043 3.2511 1.0306 3.8833 0.9955 0.9852 0.9851
dispcorr: -0.012133362 hartree
energy: -1462.053873609865
dipole: -19.23593 16.83595 -2.39999 -5.82022 3.46919 -2.35102 -9.14624 7.64338 -1.50285
magnitude: 3.68046 au
magnitude: 9.35500 debye
