program: Orca
programVersion: 5.0.2
elementType: H C C C C C C H C F F F H H N C C Cl C C N O H N H C H H H
charge: 0
multiplicity: 1
keywords: wb97x-d3
keywords: def2-TZVPP
keywords: def2/J RIJCOSX
keywords: DEFGRID2
keywords: scfconv7
keywords: smallprint printgap noloewdin
keywords: NOSOSCF
formula: C12H9ClF3N3O
InChI: InChI=1/C12H9ClF3N3O/c1-17-9-6-18-19(11(20)10(9)13)8-4-2-3-7(5-8)12(14,15)16/h2-6,17H,1H3
29 atoms
H  4.311558 1.867299 -0.597221
C  3.292132 1.514068 -0.520966
C  2.999262 0.268075 0.018159
C  4.105213 -0.645611 0.448494
C  1.683269 -0.162539 0.11588
C  0.660897 0.652849 -0.344678
C  0.942999 1.893889 -0.898544
H  0.153274 2.521815 -1.285363
C  2.258963 2.31916 -0.974376
F  4.495399 -1.452378 -0.549513
F  3.743302 -1.443297 1.458764
F  5.191388 0.026383 0.843004
H  2.481458 3.287413 -1.401767
H  1.442158 -1.126751 0.543431
N  -0.676798 0.17428 -0.265327
C  -1.678452 0.961591 0.310893
C  -2.957881 0.330849 0.341359
Cl -4.250039 1.254101 1.006404
C  -3.167425 -0.960681 -0.090187
C  -2.00059 -1.624128 -0.607142
N  -0.84409 -1.072533 -0.682043
O  -1.432936 2.078651 0.742361
H  -2.051428 -2.641274 -0.970067
N  -4.344583 -1.588432 -0.052498
H  -5.129928 -1.094839 0.340215
C  -4.558843 -2.961327 -0.447405
H  -5.611787 -3.189866 -0.310942
H  -3.982183 -3.660441 0.161081
H  -4.315154 -3.127625 -1.497566
elementType: H C F N Cl O
totalener: -1462.04586057 hartree
nucrepener: 1665.39762379 hartree
electener: -3127.44348436 hartree
oneelecener: -5318.31296966 hartree
twoeener: 2190.86948530 hartree
cpcmener: -0.03080057 hartree
kineticenergy: 1457.60604133 hartree
xcener: -111.244947131813 hartree
chargesum: 0.0000000
charge: 0.151364 -0.152141 -0.017228 0.551053 -0.169841 0.157101 -0.197344 0.149371 -0.120600 -0.181763 -0.182024 -0.181163 0.160986 0.134748 0.103845 0.313672 -0.116678 -0.092498 0.212075 -0.054465 -0.252495 -0.515642 0.133717 -0.175502 0.160003 -0.179799 0.117666 0.123631 0.119954
qa: 0.1514 -0.1521 -0.0172 0.5511 -0.1698 0.1571 -0.1973 0.1494 -0.1206 -0.1818 -0.1820 -0.1812 0.1610 0.1347 0.1038 0.3137 -0.1167 -0.0925 0.2121 -0.0545 -0.2525 -0.5156 0.1337 -0.1755 0.1600 -0.1798 0.1177 0.1236 0.1200
va: 1.0069 3.9832 3.7161 4.4241 4.1090 3.7202 4.0366 1.0133 3.9254 1.1058 1.1192 1.1199 0.9906 1.0368 3.1585 4.3510 3.7278 1.2466 3.8558 4.0626 2.9535 2.0100 1.0043 3.2388 1.0342 3.8866 0.9962 0.9848 0.9848
dispcorr: -0.012087341 hartree
energy: -1462.057947906735
dipole: -18.78884 16.52828 -2.26056 -5.73203 3.53868 -2.19334 -8.10645 6.85822 -1.24824
magnitude: 3.38807 au
magnitude: 8.61178 debye
