program: Orca
programVersion: 5.0.2
elementType: H C C C C C C H C F F F H H C O C C C O N C H H H H C C H C H C H C H C H H
charge: 0
multiplicity: 1
keywords: wb97x-d3
keywords: def2-TZVPP
keywords: def2/J RIJCOSX
keywords: DEFGRID2
keywords: scfconv7
keywords: smallprint printgap noloewdin
keywords: NOSOSCF
formula: C18H14F3NO2
InChI: InChI=1/C18H14F3NO2/c1-22-17-14(12-8-5-9-13(10-12)18(19,20)21)15(23)16(24-17)11-6-3-2-4-7-11/h2-10,16,22H,1H3
38 atoms
H  -5.065904 -0.06713 0.861937
C  -3.985041 -0.054424 0.910657
C  -3.206339 -0.219835 -0.22959
C  -3.872527 -0.473943 -1.544843
C  -1.822614 -0.200493 -0.150542
C  -1.181104 -0.022293 1.077584
C  -1.972843 0.128013 2.218595
H  -1.51192 0.224822 3.194048
C  -3.356412 0.12419 2.131352
F  -5.013079 0.215084 -1.672444
F  -4.188897 -1.769602 -1.695318
F  -3.099252 -0.145534 -2.584658
H  -3.950447 0.245916 3.027482
H  -1.224864 -0.307589 -1.044817
C  2.55872 -0.549138 0.837617
O  2.399346 0.524607 1.76168
C  1.103738 0.78839 1.89917
C  0.277327 -0.034058 1.140514
C  1.131263 -0.90799 0.420589
O  0.874147 -1.796122 -0.380355
N  0.796549 1.781959 2.70935
C  1.763974 2.636213 3.368736
H  -0.172019 2.059867 2.749156
H  1.233242 3.23337 4.105489
H  2.258814 3.3119 2.668423
H  2.519239 2.050961 3.890814
C  3.405796 -0.15093 -0.334228
C  3.579782 1.176958 -0.708713
H  3.140849 1.980008 -0.130859
C  4.329923 1.488712 -1.835146
H  4.467692 2.525911 -2.113096
C  4.899262 0.482044 -2.601713
H  5.48165 0.729951 -3.479799
C  4.720966 -0.844672 -2.232899
H  5.162813 -1.637982 -2.8221
C  3.982272 -1.15909 -1.102143
H  3.861311 -2.195974 -0.812403
H  3.008532 -1.392811 1.369804
elementType: H C F O N
totalener: -1199.25025371 hartree
nucrepener: 2007.24572276 hartree
electener: -3206.49597647 hartree
oneelecener: -5630.35384777 hartree
twoeener: 2423.85787130 hartree
cpcmener: -0.03882969 hartree
kineticenergy: 1194.50025041 hartree
xcener: -110.234119067988 hartree
chargesum: -0.0000000
charge: 0.149106 -0.130439 -0.084944 0.543710 -0.169611 -0.012266 -0.202107 0.149949 -0.173651 -0.185170 -0.183528 -0.182452 0.156529 0.135911 0.261476 -0.312286 0.391862 -0.059741 0.180566 -0.523271 -0.193917 -0.156952 0.198264 0.117577 0.117820 0.114447 0.073236 -0.208045 0.152481 -0.151957 0.156259 -0.163950 0.157866 -0.151499 0.157524 -0.235704 0.138045 0.128860
qa: 0.1491 -0.1304 -0.0849 0.5437 -0.1696 -0.0123 -0.2021 0.1499 -0.1737 -0.1852 -0.1835 -0.1825 0.1565 0.1359 0.2615 -0.3123 0.3919 -0.0597 0.1806 -0.5233 -0.1939 -0.1570 0.1983 0.1176 0.1178 0.1144 0.0732 -0.2080 0.1525 -0.1520 0.1563 -0.1640 0.1579 -0.1515 0.1575 -0.2357 0.1380 0.1289
va: 1.0056 3.9610 3.7651 4.4400 3.9908 3.6044 3.9364 1.0098 3.9578 1.1128 1.1044 1.1188 0.9943 1.0392 3.7645 2.1615 3.9751 3.3064 4.2149 2.0014 3.3016 3.8918 0.9920 0.9960 0.9887 0.9945 3.5500 3.9438 1.0028 3.9085 0.9924 3.9067 0.9901 3.9025 0.9909 4.0291 1.0167 1.0039
dispcorr: -0.017226558 hartree
energy: -1199.267480268949
dipole: 29.54643 -28.40818 1.13825 11.36025 -8.50013 2.86013 16.37633 -13.04271 3.33362
magnitude: 4.53750 au
magnitude: 11.53342 debye
