program: Orca
programVersion: 5.0.2
elementType: H C C C C C C H C F F F H H C O C C C O N C H H H H C C H C H C H C H C H H
charge: 0
multiplicity: 1
keywords: wb97x-d3
keywords: def2-TZVPP
keywords: def2/J RIJCOSX
keywords: DEFGRID2
keywords: scfconv7
keywords: smallprint printgap noloewdin
keywords: NOSOSCF
formula: C18H14F3NO2
InChI: InChI=1/C18H14F3NO2/c1-22-17-14(12-8-5-9-13(10-12)18(19,20)21)15(23)16(24-17)11-6-3-2-4-7-11/h2-10,16,22H,1H3
38 atoms
H  -4.58549 -2.169569 0.225792
C  -3.589847 -1.770027 0.359781
C  -3.210335 -0.563074 -0.207752
C  -4.153441 0.238875 -1.047695
C  -1.922951 -0.070439 -0.025303
C  -0.994914 -0.761998 0.752121
C  -1.386684 -1.982221 1.314155
H  -0.692378 -2.541222 1.926659
C  -2.663733 -2.475923 1.116017
F  -4.327613 1.474861 -0.553968
F  -5.364295 -0.315245 -1.144501
F  -3.694537 0.39464 -2.298936
H  -2.94806 -3.419622 1.562678
H  -1.626171 0.850112 -0.514721
C  2.699448 -0.00848 1.090806
O  2.048647 1.249546 1.260535
C  0.734779 1.071511 1.169701
C  0.357035 -0.248975 0.952067
C  1.555067 -1.00979 0.918601
O  1.737457 -2.208473 0.760965
N  -0.005949 2.153271 1.315341
C  0.52019 3.470504 1.608739
H  -1.004964 2.024762 1.366683
H  0.90893 3.540023 2.625613
H  -0.290328 4.185265 1.501186
H  1.306862 3.747715 0.909509
C  3.617855 -0.003501 -0.094179
C  4.736162 -0.829723 -0.076633
H  4.963435 -1.410269 0.80946
C  5.570221 -0.905936 -1.182832
H  6.439514 -1.550303 -1.156468
C  5.294002 -0.152985 -2.315055
H  5.946849 -0.206355 -3.176739
C  4.177755 0.67256 -2.335722
H  3.956409 1.263177 -3.21547
C  3.338699 0.745677 -1.233468
H  2.470795 1.392083 -1.27393
H  3.253234 -0.226156 2.008696
elementType: H C F O N
totalener: -1199.25057027 hartree
nucrepener: 2009.92716202 hartree
electener: -3209.17773229 hartree
oneelecener: -5635.13782725 hartree
twoeener: 2425.96009496 hartree
cpcmener: -0.03729335 hartree
kineticenergy: 1194.50058044 hartree
xcener: -110.233449359928 hartree
chargesum: -0.0000000
charge: 0.151867 -0.104410 -0.084738 0.549755 -0.243790 0.003472 -0.184447 0.142271 -0.171559 -0.186890 -0.180992 -0.185093 0.157111 0.143598 0.272457 -0.311128 0.389308 -0.061334 0.176845 -0.522815 -0.192664 -0.158865 0.197242 0.118494 0.117401 0.114493 0.050883 -0.229553 0.139730 -0.149804 0.157132 -0.154784 0.158006 -0.164635 0.156499 -0.190577 0.153215 0.128296
qa: 0.1519 -0.1044 -0.0847 0.5498 -0.2438 0.0035 -0.1844 0.1423 -0.1716 -0.1869 -0.1810 -0.1851 0.1571 0.1436 0.2725 -0.3111 0.3893 -0.0613 0.1768 -0.5228 -0.1927 -0.1589 0.1972 0.1185 0.1174 0.1145 0.0509 -0.2296 0.1397 -0.1498 0.1571 -0.1548 0.1580 -0.1646 0.1565 -0.1906 0.1532 0.1283
va: 1.0044 3.9011 3.7804 4.4461 4.0192 3.6003 3.9684 1.0180 3.9621 1.1072 1.1226 1.1092 0.9941 1.0317 3.7626 2.1578 3.9639 3.2603 4.2283 2.0015 3.3012 3.8959 0.9914 0.9903 0.9960 0.9933 3.5763 4.0350 1.0101 3.9014 0.9911 3.8990 0.9899 3.9218 0.9930 3.9388 0.9980 1.0062
dispcorr: -0.017324572 hartree
energy: -1199.267894847414
dipole: 29.41587 -29.27319 0.14268 3.86018 -1.25854 2.60164 7.50324 -6.25163 1.25161
magnitude: 2.89057 au
magnitude: 7.34726 debye
