program: Orca
programVersion: 5.0.2
elementType: H C C C C C C H C F F F H H C O C C C O N C H H H H C C H C H C H C H C H H
charge: 0
multiplicity: 1
keywords: wb97x-d3
keywords: def2-TZVPP
keywords: def2/J RIJCOSX
keywords: DEFGRID2
keywords: scfconv7
keywords: smallprint printgap noloewdin
keywords: NOSOSCF
formula: C18H14F3NO2
InChI: InChI=1/C18H14F3NO2/c1-22-17-14(12-8-5-9-13(10-12)18(19,20)21)15(23)16(24-17)11-6-3-2-4-7-11/h2-10,16,22H,1H3
38 atoms
H  -5.070591 -0.023246 0.885714
C  -3.990487 -0.036476 0.933918
C  -3.225327 -0.254997 -0.206157
C  -3.905561 -0.53072 -1.512875
C  -1.842411 -0.264388 -0.136664
C  -1.189645 -0.05443 1.079792
C  -1.96914 0.138876 2.221907
H  -1.49351 0.234225 3.19097
C  -3.35287 0.158763 2.145871
F  -5.061477 0.135342 -1.619367
F  -4.192258 -1.830294 -1.650387
F  -3.149318 -0.18378 -2.557355
H  -3.938627 0.310702 3.042671
H  -1.251869 -0.430604 -1.02606
C  2.564671 -0.545328 0.827764
O  2.383639 0.524557 1.753125
C  1.079842 0.761105 1.879172
C  0.267043 -0.06227 1.135855
C  1.138294 -0.931574 0.397917
O  0.892235 -1.804997 -0.400576
N  0.753072 1.762243 2.699576
C  1.709637 2.672466 3.289186
H  -0.211596 2.047602 2.670719
H  1.197871 3.260905 4.046251
H  2.147341 3.356881 2.559068
H  2.514186 2.128038 3.777509
C  3.42507 -0.140298 -0.332059
C  3.746503 1.184207 -0.59837
H  3.407884 1.975102 0.056502
C  4.515461 1.505372 -1.708086
H  4.763252 2.540452 -1.903548
C  4.964099 0.511409 -2.562353
H  5.563235 0.765088 -3.426707
C  4.641154 -0.812277 -2.300288
H  4.983893 -1.596789 -2.961718
C  3.878271 -1.136989 -1.191458
H  3.624582 -2.171344 -0.999501
H  3.017472 -1.383109 1.367615
totalener: -1199.22211985 hartree
nucrepener: 2006.65229134 hartree
electener: -3205.87441119 hartree
oneelecener: -5628.31221623 hartree
twoeener: 2422.43780504 hartree
kineticenergy: 1194.55157401 hartree
xcener: -110.238250394014 hartree
chargesum: 0.0000000
charge: 0.126941 -0.107390 -0.096715 0.533855 -0.124203 0.006506 -0.243333 0.138835 -0.135510 -0.178745 -0.167831 -0.173009 0.125802 0.127374 0.196137 -0.304284 0.385459 -0.051555 0.155139 -0.375479 -0.232736 -0.156377 0.166141 0.103056 0.108641 0.114250 0.072347 -0.183801 0.116538 -0.111471 0.121161 -0.129457 0.125412 -0.126141 0.125905 -0.173863 0.113425 0.108974
qa: 0.1269 -0.1074 -0.0967 0.5339 -0.1242 0.0065 -0.2433 0.1388 -0.1355 -0.1787 -0.1678 -0.1730 0.1258 0.1274 0.1961 -0.3043 0.3855 -0.0516 0.1551 -0.3755 -0.2327 -0.1564 0.1661 0.1031 0.1086 0.1143 0.0723 -0.1838 0.1165 -0.1115 0.1212 -0.1295 0.1254 -0.1261 0.1259 -0.1739 0.1134 0.1090
va: 1.0138 4.0052 3.8527 4.4511 4.0295 3.6419 3.9624 1.0135 3.9881 1.1212 1.1272 1.1324 1.0051 1.0418 3.8506 2.1579 3.9296 3.3279 4.2098 2.1472 3.2316 3.9166 1.0166 0.9980 0.9881 0.9967 3.6626 3.9960 1.0124 3.9558 1.0018 3.9650 0.9998 3.9609 1.0005 4.0491 1.0297 1.0040
dispcorr: -0.017197064 hartree
energy: -1199.239316913856
dipole: 29.72218 -28.74929 0.97290 11.89049 -10.06560 1.82489 16.00005 -13.87393 2.12612
magnitude: 2.96600 au
magnitude: 7.53897 debye
