program: Orca
programVersion: 5.0.2
elementType: H C C C C C C H C F F F H H H C Cl C C H H N C O C H H Cl H
charge: 0
multiplicity: 1
keywords: wb97x-d3
keywords: def2-TZVPP
keywords: def2/J RIJCOSX
keywords: DEFGRID2
keywords: scfconv7
keywords: smallprint printgap noloewdin
keywords: NOSOSCF
formula: C12H10Cl2F3NO
InChI: InChI=1/C12H10Cl2F3NO/c13-5-7-6-18(11(19)10(7)14)9-3-1-2-8(4-9)12(15,16)17/h1-4,7,10H,5-6H2
29 atoms
H  4.28002 1.305502 0.852537
C  3.257722 1.075201 0.588499
C  2.921123 -0.112301 -0.041765
C  3.963953 -1.124491 -0.401034
C  1.60269 -0.386379 -0.38489
C  0.597284 0.528791 -0.088054
C  0.929245 1.714458 0.571796
H  0.169035 2.425124 0.854482
C  2.248566 1.977051 0.893489
F  5.173555 -0.809352 0.067033
F  4.083527 -1.258831 -1.730282
F  3.664922 -2.341123 0.075988
H  2.493031 2.899541 1.402426
H  1.360456 -1.311394 -0.892536
H  -2.84571 0.216583 -2.2762
C  -2.900163 0.301903 -1.187154
Cl -4.428779 1.120746 -0.81338
C  -2.700535 -1.071946 -0.56028
C  -1.170897 -1.167529 -0.557663
H  -0.790449 -1.764012 0.272574
H  -0.813576 -1.613336 -1.487834
N  -0.723517 0.217319 -0.436181
C  -1.697278 1.111706 -0.738249
O  -1.6193 2.322351 -0.730262
C  -3.32302 -1.270991 0.805365
H  -3.123623 -1.850617 -1.196105
H  -4.406002 -1.185659 0.761969
Cl -2.744924 -0.081987 2.021902
H  -3.070111 -2.259914 1.181271
elementType: H C F Cl N O
totalener: -1813.38995164 hartree
nucrepener: 1754.64091988 hartree
electener: -3568.03087153 hartree
oneelecener: -5985.00377659 hartree
twoeener: 2416.97290506 hartree
cpcmener: -0.03848880 hartree
kineticenergy: 1808.62074671 hartree
xcener: -122.762309055620 hartree
chargesum: -0.0000000
charge: 0.153604 -0.162411 -0.029316 0.558891 -0.209121 0.134022 -0.215076 0.147754 -0.121065 -0.180688 -0.184862 -0.185552 0.163655 0.143362 0.145887 0.074936 -0.141337 0.021414 -0.142451 0.135466 0.128832 -0.032730 0.220502 -0.499242 -0.120226 0.101413 0.132794 -0.180646 0.142190
qa: 0.1536 -0.1624 -0.0293 0.5589 -0.2091 0.1340 -0.2151 0.1478 -0.1211 -0.1807 -0.1849 -0.1856 0.1637 0.1434 0.1459 0.0749 -0.1413 0.0214 -0.1425 0.1355 0.1288 -0.0327 0.2205 -0.4992 -0.1202 0.1014 0.1328 -0.1806 0.1422
va: 1.0060 3.9521 3.7346 4.4259 4.0615 3.8158 3.9947 1.0280 3.9435 1.1234 1.1080 1.1114 0.9904 1.0263 1.0118 4.0736 1.1724 3.9604 3.9597 0.9945 0.9927 3.1696 4.2146 2.0057 4.0267 1.0115 1.0139 1.1165 1.0027
dispcorr: -0.014603643 hartree
energy: -1813.404555285985
dipole: -8.61483 8.23230 -0.38253 -0.33127 -2.19937 -2.53064 -0.42167 -0.09088 -0.51255
magnitude: 2.61020 au
magnitude: 6.63461 debye
