program: Orca
programVersion: 5.0.2
elementType: H C C C C C C H C F F F H H H C Cl C C H H N C O C H H Cl H
charge: 0
multiplicity: 1
keywords: wb97x-d3
keywords: def2-TZVPP
keywords: def2/J RIJCOSX
keywords: DEFGRID2
keywords: scfconv7
keywords: smallprint printgap noloewdin
keywords: NOSOSCF
formula: C12H10Cl2F3NO
InChI: InChI=1/C12H10Cl2F3NO/c13-5-7-6-18(11(19)10(7)14)9-3-1-2-8(4-9)12(15,16)17/h1-4,7,10H,5-6H2
29 atoms
H  4.297944 0.72928 -1.539069
C  3.24384 0.768025 -1.300247
C  2.720261 0.082727 -0.21102
C  3.633525 -0.696767 0.68443
C  1.367166 0.140319 0.089321
C  0.515077 0.902211 -0.708146
C  1.035678 1.584283 -1.805997
H  0.391364 2.177772 -2.440882
C  2.387695 1.511123 -2.09597
F  2.99892 -1.676293 1.337242
F  4.191736 0.086897 1.61935
F  4.640561 -1.265029 0.012229
H  2.775492 2.04566 -2.952252
H  0.974487 -0.420412 0.922046
H  -3.170253 2.074102 0.690862
C  -2.946223 1.01805 0.517954
Cl -3.919944 0.088612 1.672016
C  -3.152169 0.689399 -0.954625
C  -1.819084 1.157726 -1.54561
H  -1.522804 0.574258 -2.417999
H  -1.872959 2.206853 -1.84017
N  -0.861555 0.967646 -0.458389
C  -1.45951 0.82223 0.747534
O  -0.922141 0.639542 1.820225
C  -3.46876 -0.755392 -1.267943
H  -3.975369 1.27287 -1.36863
H  -4.41164 -1.061934 -0.820755
Cl -2.206422 -1.891055 -0.675478
H  -3.537686 -0.890288 -2.345551
elementType: H C F Cl N O
totalener: -1813.38989297 hartree
nucrepener: 1773.77204476 hartree
electener: -3587.16193773 hartree
oneelecener: -6024.00707287 hartree
twoeener: 2436.84513513 hartree
cpcmener: -0.04125885 hartree
kineticenergy: 1808.64271052 hartree
xcener: -122.766521660835 hartree
chargesum: 0.0000000
charge: 0.153104 -0.179637 -0.031666 0.550186 -0.176437 0.134602 -0.218498 0.155287 -0.120375 -0.182896 -0.183690 -0.183169 0.163801 0.135787 0.145636 0.071357 -0.141617 0.028906 -0.142534 0.134199 0.129771 -0.034963 0.217476 -0.500165 -0.118720 0.100774 0.132531 -0.180972 0.141925
qa: 0.1531 -0.1796 -0.0317 0.5502 -0.1764 0.1346 -0.2185 0.1553 -0.1204 -0.1829 -0.1837 -0.1832 0.1638 0.1358 0.1456 0.0714 -0.1416 0.0289 -0.1425 0.1342 0.1298 -0.0350 0.2175 -0.5002 -0.1187 0.1008 0.1325 -0.1810 0.1419
va: 1.0059 4.0007 3.7568 4.4240 4.0204 3.8160 3.9869 0.9988 3.9230 1.1178 1.1036 1.1162 0.9891 1.0567 1.0118 4.0804 1.1727 3.9547 3.9604 0.9948 0.9934 3.1619 4.2228 2.0036 4.0273 1.0116 1.0139 1.1182 1.0032
dispcorr: -0.014715817 hartree
energy: -1813.404608790015
dipole: -12.12865 10.25617 -1.87248 13.23341 -11.04999 2.18342 -17.37846 13.40565 -3.97281
magnitude: 4.90476 au
magnitude: 12.46692 debye
