program: Orca
programVersion: 5.0.2
elementType: H C C C C C C H C F F F H H H C Cl C C H H N C O C H H Cl H
charge: 0
multiplicity: 1
keywords: wb97x-d3
keywords: def2-TZVPP
keywords: def2/J RIJCOSX
keywords: DEFGRID2
keywords: scfconv7
keywords: smallprint printgap noloewdin
keywords: NOSOSCF
formula: C12H10Cl2F3NO
InChI: InChI=1/C12H10Cl2F3NO/c13-5-7-6-18(11(19)10(7)14)9-3-1-2-8(4-9)12(15,16)17/h1-4,7,10H,5-6H2
29 atoms
H  4.287615 1.304034 0.841814
C  3.264546 1.082337 0.572158
C  2.912847 -0.115116 -0.029162
C  3.936359 -1.15913 -0.353577
C  1.591556 -0.376063 -0.370996
C  0.59555 0.557739 -0.100443
C  0.945169 1.76081 0.519114
H  0.198496 2.496559 0.770913
C  2.267525 2.009449 0.839906
F  5.143684 -0.872267 0.13806
F  4.082033 -1.314733 -1.677295
F  3.590119 -2.360122 0.131559
H  2.524043 2.943569 1.321668
H  1.339512 -1.310552 -0.855112
H  -2.873975 0.262947 -2.249387
C  -2.915447 0.318073 -1.157849
Cl -4.448004 1.10642 -0.744274
C  -2.689391 -1.070287 -0.573154
C  -1.158897 -1.143259 -0.585323
H  -0.764947 -1.757068 0.226075
H  -0.801784 -1.559259 -1.529917
N  -0.72817 0.242897 -0.429542
C  -1.717681 1.133149 -0.702536
O  -1.657422 2.340706 -0.664662
C  -3.296592 -1.324604 0.78948
H  -3.105913 -1.835878 -1.229855
H  -4.381397 -1.253953 0.758259
Cl -2.722277 -0.175749 2.044325
H  -3.029895 -2.324222 1.127262
elementType: H C F Cl N O
totalener: -1813.39869190 hartree
nucrepener: 1754.55468662 hartree
electener: -3567.95337851 hartree
oneelecener: -5984.78583949 hartree
twoeener: 2416.83246097 hartree
cpcmener: -0.03122214 hartree
kineticenergy: 1808.62731472 hartree
xcener: -122.762784600061 hartree
chargesum: 0.0000000
charge: 0.151978 -0.166304 -0.032322 0.557874 -0.212789 0.136443 -0.211446 0.148820 -0.114627 -0.179929 -0.183533 -0.185110 0.160151 0.138808 0.140869 0.076116 -0.135501 0.012528 -0.146155 0.132806 0.127149 -0.034504 0.205882 -0.462297 -0.121368 0.098959 0.131792 -0.173320 0.139026
qa: 0.1520 -0.1663 -0.0323 0.5579 -0.2128 0.1364 -0.2114 0.1488 -0.1146 -0.1799 -0.1835 -0.1851 0.1602 0.1388 0.1409 0.0761 -0.1355 0.0125 -0.1462 0.1328 0.1271 -0.0345 0.2059 -0.4623 -0.1214 0.0990 0.1318 -0.1733 0.1390
va: 1.0064 3.9597 3.7522 4.4271 4.0494 3.8432 3.9966 1.0299 3.9386 1.1246 1.1095 1.1119 0.9913 1.0295 1.0130 4.0756 1.1784 3.9653 3.9590 0.9942 0.9922 3.1665 4.2295 2.0506 4.0325 1.0117 1.0140 1.1221 1.0022
dispcorr: -0.014555070 hartree
energy: -1813.413246966756
dipole: -8.36190 7.97702 -0.38488 0.09685 -2.35966 -2.26280 -1.06955 0.45380 -0.61575
magnitude: 2.37646 au
magnitude: 6.04047 debye
