program: Orca
programVersion: 5.0.2
elementType: H C C C C C C H C F F F H H H C Cl C C H H N C O C H H Cl H
charge: 0
multiplicity: 1
keywords: wb97x-d3
keywords: def2-TZVPP
keywords: def2/J RIJCOSX
keywords: DEFGRID2
keywords: scfconv7
keywords: smallprint printgap noloewdin
keywords: NOSOSCF
formula: C12H10Cl2F3NO
InChI: InChI=1/C12H10Cl2F3NO/c13-5-7-6-18(11(19)10(7)14)9-3-1-2-8(4-9)12(15,16)17/h1-4,7,10H,5-6H2
29 atoms
H  4.22303 -1.772532 0.972475
C  3.223628 -1.407107 0.77855
C  3.008555 -0.220179 0.089159
C  4.17587 0.594019 -0.380357
C  1.723304 0.242479 -0.152652
C  0.628597 -0.490737 0.300222
C  0.840223 -1.688413 0.979041
H  0.003153 -2.276548 1.332175
C  2.129489 -2.137363 1.212445
F  5.231146 -0.170884 -0.685534
F  4.588791 1.462059 0.555511
F  3.8875 1.315545 -1.468574
H  2.280093 -3.068751 1.741875
H  1.571186 1.152094 -0.713074
H  -2.93747 2.058277 -0.792183
C  -2.599923 1.226306 -0.17801
Cl -3.336341 1.435156 1.455709
C  -2.858498 -0.147922 -0.769036
C  -1.784844 -1.005491 -0.106296
H  -2.119805 -1.391252 0.861444
H  -1.478785 -1.846847 -0.725293
N  -0.684131 -0.06169 0.04959
C  -1.095244 1.234429 0.041941
O  -0.41712 2.222516 0.212052
C  -4.272794 -0.659586 -0.639468
H  -2.614736 -0.054608 -1.832654
H  -4.56869 -0.805039 0.396444
Cl -4.425634 -2.256823 -1.452581
H  -4.979252 0.015642 -1.118717
elementType: H C F Cl N O
totalener: -1813.40064353 hartree
nucrepener: 1706.97880865 hartree
electener: -3520.37945218 hartree
oneelecener: -5889.10245422 hartree
twoeener: 2368.72300204 hartree
cpcmener: -0.02760061 hartree
kineticenergy: 1808.60264305 hartree
xcener: -122.752222898792 hartree
chargesum: 0.0000000
charge: 0.151063 -0.164267 -0.032123 0.550773 -0.176858 0.127243 -0.191223 0.153470 -0.131953 -0.182984 -0.181714 -0.181923 0.160231 0.137389 0.149365 0.068784 -0.157541 -0.016434 -0.137598 0.123859 0.132783 -0.043310 0.231692 -0.464832 -0.107463 0.096204 0.118934 -0.181906 0.150336
qa: 0.1511 -0.1643 -0.0321 0.5508 -0.1769 0.1272 -0.1912 0.1535 -0.1320 -0.1830 -0.1817 -0.1819 0.1602 0.1374 0.1494 0.0688 -0.1575 -0.0164 -0.1376 0.1239 0.1328 -0.0433 0.2317 -0.4648 -0.1075 0.0962 0.1189 -0.1819 0.1503
va: 1.0066 3.9884 3.7506 4.4219 4.0471 3.8106 3.9689 0.9994 3.9404 1.1166 1.1068 1.1190 0.9910 1.0454 1.0102 4.0188 1.1555 3.9298 3.9181 0.9942 1.0082 3.1992 4.2689 2.0473 4.0207 1.0285 1.0188 1.1018 0.9985
dispcorr: -0.014116691 hartree
energy: -1813.414760218993
dipole: -12.20280 10.67123 -1.53157 -8.69305 6.80038 -1.89267 1.74580 -2.01841 -0.27262
magnitude: 2.44995 au
magnitude: 6.22727 debye
