program: Orca
programVersion: 5.0.2
elementType: H C C C C C C H C F F F H H H C Cl C C H H N C O C H H Cl H
charge: 0
multiplicity: 1
keywords: wb97x-d3
keywords: def2-TZVPP
keywords: def2/J RIJCOSX
keywords: DEFGRID2
keywords: scfconv7
keywords: smallprint printgap noloewdin
keywords: NOSOSCF
formula: C12H10Cl2F3NO
InChI: InChI=1/C12H10Cl2F3NO/c13-5-7-6-18(11(19)10(7)14)9-3-1-2-8(4-9)12(15,16)17/h1-4,7,10H,5-6H2
29 atoms
H  4.642792 1.545662 -0.702035
C  3.58413 1.342338 -0.632823
C  3.114391 0.153838 -0.104494
C  4.049545 -0.910436 0.3841
C  1.749422 -0.09143 -0.020806
C  0.829569 0.846472 -0.480961
C  1.304837 2.046999 -1.019173
H  0.622466 2.795321 -1.385073
C  2.665247 2.278706 -1.08271
F  5.331791 -0.576657 0.234116
F  3.858595 -2.058486 -0.278711
F  3.85528 -1.177259 1.681279
H  3.017029 3.211775 -1.501274
H  1.409585 -1.020659 0.416018
H  -3.71121 1.08464 -0.687626
C  -2.849067 0.687576 -0.157782
Cl -3.151649 0.883512 1.598385
C  -2.48183 -0.740042 -0.509314
C  -1.003712 -0.79962 -0.12912
H  -0.870565 -1.05645 0.92788
H  -0.461392 -1.531159 -0.729259
N  -0.538387 0.547611 -0.409437
C  -1.569633 1.456046 -0.460783
O  -1.499266 2.635076 -0.680522
C  -3.313237 -1.845103 0.096476
H  -2.551324 -0.814369 -1.600147
H  -2.936631 -2.81956 -0.211725
Cl -5.00577 -1.723171 -0.455249
H  -3.314272 -1.799077 1.183467
totalener: -1813.37743608 hartree
nucrepener: 1711.95525681 hartree
electener: -3525.33269289 hartree
oneelecener: -5898.85718223 hartree
twoeener: 2373.52448934 hartree
kineticenergy: 1808.65981399 hartree
xcener: -122.763509352417 hartree
chargesum: -0.0000000
charge: 0.137606 -0.147056 -0.074570 0.546553 -0.188821 0.147082 -0.188641 0.147894 -0.078727 -0.171755 -0.174865 -0.172364 0.131462 0.111637 0.134551 0.091485 -0.118409 -0.073466 -0.173081 0.115180 0.123357 -0.055312 0.193589 -0.352648 -0.100184 0.087432 0.121315 -0.125663 0.106420
qa: 0.1376 -0.1471 -0.0746 0.5466 -0.1888 0.1471 -0.1886 0.1479 -0.0787 -0.1718 -0.1749 -0.1724 0.1315 0.1116 0.1346 0.0915 -0.1184 -0.0735 -0.1731 0.1152 0.1234 -0.0553 0.1936 -0.3526 -0.1002 0.0874 0.1213 -0.1257 0.1064
va: 1.0120 3.9892 3.9112 4.4386 4.0338 3.9347 4.0327 1.0375 3.9521 1.1365 1.1238 1.1278 1.0013 1.0383 1.0216 3.9803 1.1994 3.9990 3.9890 0.9950 0.9952 3.1967 4.2641 2.1534 4.0536 1.0255 0.9999 1.1596 1.0236
dispcorr: -0.013898784 hartree
energy: -1813.391334868175
dipole: -5.00901 5.07589 0.06688 4.31762 -5.05522 -0.73760 -7.10305 6.58146 -0.52159
magnitude: 0.90586 au
magnitude: 2.30251 debye
