program: Orca
programVersion: 5.0.2
elementType: H C C C C C C H C F F F H H C C C C C O N H C H H H H H C C H C H C H C C H
charge: 0
multiplicity: 1
keywords: wb97x-d3
keywords: def2-TZVPP
keywords: def2/J RIJCOSX
keywords: DEFGRID2
keywords: scfconv7
keywords: smallprint printgap noloewdin
keywords: NOSOSCF
formula: C19H14F3NO
InChI: InChI=1/C19H14F3NO/c1-23-11-16(13-6-3-2-4-7-13)18(24)17(12-23)14-8-5-9-15(10-14)19(20,21)22/h2-12H,1H3
38 atoms
H  -4.611179 -2.321856 0.333052
C  -3.669712 -1.790232 0.346524
C  -3.55723 -0.505604 -0.1636
C  -4.739424 0.183182 -0.768922
C  -2.329937 0.14951 -0.153762
C  -1.203048 -0.455856 0.395777
C  -1.330187 -1.747088 0.915756
H  -0.479377 -2.236977 1.367536
C  -2.547829 -2.403005 0.885447
F  -4.850892 1.452073 -0.350972
F  -5.892513 -0.42368 -0.472631
F  -4.659038 0.230218 -2.10736
H  -2.628997 -3.402291 1.292043
H  -2.239561 1.139812 -0.584463
C  0.080646 0.269029 0.455797
C  1.322169 -0.393556 0.090836
C  2.51463 0.428823 0.229866
C  2.405976 1.730143 0.608863
C  0.088966 1.579738 0.827321
O  1.362869 -1.555403 -0.325925
N  1.218276 2.314233 0.888073
H  -0.820014 2.095568 1.107077
C  1.185456 3.706591 1.31378
H  0.163043 4.071568 1.281181
H  1.78912 4.312037 0.641329
H  1.566115 3.810085 2.328698
H  3.274977 2.365518 0.720486
H  5.828936 -2.790071 0.639293
C  5.52522 -1.846436 0.204004
C  6.402762 -1.141312 -0.609789
H  7.390087 -1.534497 -0.815913
C  6.003715 0.06943 -1.156425
H  6.676883 0.625558 -1.796371
C  4.734594 0.567782 -0.895818
H  4.427574 1.504738 -1.345016
C  3.846228 -0.129358 -0.076734
C  4.258242 -1.348828 0.465807
H  3.596166 -1.904391 1.116249
elementType: H C F O N
totalener: -1162.12019672 hartree
nucrepener: 1923.45542829 hartree
electener: -3085.57562501 hartree
oneelecener: -5410.52307273 hartree
twoeener: 2324.94744773 hartree
cpcmener: -0.04150235 hartree
kineticenergy: 1157.45637222 hartree
xcener: -107.880935373106 hartree
chargesum: -0.0000000
charge: 0.149988 -0.108457 -0.084873 0.547435 -0.202853 0.036271 -0.174615 0.141977 -0.170083 -0.186479 -0.182194 -0.183829 0.157227 0.140973 -0.037367 0.272404 0.007655 0.084101 0.065877 -0.555413 -0.084264 0.146709 -0.146779 0.110677 0.122277 0.130041 0.144622 0.154532 -0.175112 -0.144143 0.157267 -0.176394 0.154068 -0.221024 0.146236 0.022846 -0.198967 0.139662
qa: 0.1500 -0.1085 -0.0849 0.5474 -0.2029 0.0363 -0.1746 0.1420 -0.1701 -0.1865 -0.1822 -0.1838 0.1572 0.1410 -0.0374 0.2724 0.0077 0.0841 0.0659 -0.5554 -0.0843 0.1467 -0.1468 0.1107 0.1223 0.1300 0.1446 0.1545 -0.1751 -0.1441 0.1573 -0.1764 0.1541 -0.2210 0.1462 0.0228 -0.1990 0.1397
va: 1.0058 3.9191 3.7620 4.4423 4.0356 3.5904 3.9577 1.0184 3.9531 1.1106 1.1197 1.1060 0.9939 1.0231 3.4888 4.1062 3.4676 3.8731 3.9116 1.9625 3.4895 0.9964 3.8533 1.0004 0.9903 0.9871 0.9992 0.9944 3.9261 3.8887 0.9904 3.9268 0.9945 3.9517 1.0055 3.5108 3.9436 1.0187
dispcorr: -0.016215137 hartree
energy: -1162.136411858015
dipole: 36.79966 -35.75519 1.04448 4.19554 -0.84832 3.34722 8.83642 -6.97171 1.86471
magnitude: 3.97139 au
magnitude: 10.09448 debye
