program: Orca
programVersion: 5.0.2
elementType: H C C C C C C H C F F F H H C C C C C O N H C H H H H H C C H C H C H C C H
charge: 0
multiplicity: 1
keywords: wb97x-d3
keywords: def2-TZVPP
keywords: def2/J RIJCOSX
keywords: DEFGRID2
keywords: scfconv7
keywords: smallprint printgap noloewdin
keywords: NOSOSCF
formula: C19H14F3NO
InChI: InChI=1/C19H14F3NO/c1-23-11-16(13-6-3-2-4-7-13)18(24)17(12-23)14-8-5-9-15(10-14)19(20,21)22/h2-12H,1H3
38 atoms
H  -5.193026 0.27162 0.910855
C  -4.148032 0.466708 0.70775
C  -3.364681 -0.469836 0.039284
C  -4.006562 -1.745996 -0.416817
C  -2.026811 -0.218463 -0.209198
C  -1.443844 0.981615 0.205135
C  -2.23388 1.903391 0.885748
H  -1.788987 2.817777 1.258801
C  -3.576363 1.652544 1.127972
F  -3.127608 -2.617919 -0.912999
F  -4.916704 -1.515201 -1.37338
F  -4.651574 -2.357226 0.584839
H  -4.172516 2.379465 1.663083
H  -1.424668 -0.948858 -0.726338
C  -0.02586 1.270871 -0.069847
C  0.991165 0.23676 0.145958
C  2.370007 0.68597 -0.06842
C  2.612742 1.94776 -0.49777
C  0.338228 2.503229 -0.503438
O  0.712746 -0.899942 0.490334
N  1.629353 2.860476 -0.717303
H  -0.398643 3.267583 -0.715302
C  1.952957 4.145096 -1.304326
H  2.022214 4.086143 -2.391325
H  2.90252 4.503341 -0.912115
H  1.1888 4.873177 -1.042797
H  3.619799 2.28802 -0.702812
H  6.530839 -0.241025 1.729595
C  5.688321 -0.605523 1.15657
C  5.683159 -1.904013 0.67267
H  6.52445 -2.558825 0.858054
C  4.586024 -2.362728 -0.042816
H  4.571527 -3.376948 -0.420055
C  3.500268 -1.53509 -0.274356
H  2.653315 -1.909858 -0.829819
C  3.498964 -0.222405 0.198735
C  4.602924 0.224919 0.923276
H  4.600256 1.226801 1.335746
totalener: -1162.08930195 hartree
nucrepener: 1935.75220076 hartree
electener: -3097.84150271 hartree
oneelecener: -5434.53801669 hartree
twoeener: 2336.69651398 hartree
kineticenergy: 1157.49578268 hartree
xcener: -107.882517202483 hartree
chargesum: 0.0000000
charge: 0.120342 -0.114185 -0.118744 0.539252 -0.081174 0.072760 -0.197435 0.122071 -0.143503 -0.170922 -0.176703 -0.175915 0.124511 0.128201 -0.057881 0.235901 -0.023094 0.048049 0.042276 -0.409118 -0.100677 0.116847 -0.150051 0.126557 0.102323 0.097603 0.118753 0.121017 -0.144579 -0.107841 0.123809 -0.149584 0.122910 -0.128658 0.115842 0.073784 -0.221346 0.118600
qa: 0.1203 -0.1142 -0.1187 0.5393 -0.0812 0.0728 -0.1974 0.1221 -0.1435 -0.1709 -0.1767 -0.1759 0.1245 0.1282 -0.0579 0.2359 -0.0231 0.0480 0.0423 -0.4091 -0.1007 0.1168 -0.1501 0.1266 0.1023 0.0976 0.1188 0.1210 -0.1446 -0.1078 0.1238 -0.1496 0.1229 -0.1287 0.1158 0.0738 -0.2213 0.1186
va: 1.0143 4.0287 3.8764 4.4461 3.9433 3.6151 4.0153 1.0078 3.9893 1.1367 1.1182 1.1250 1.0039 1.0451 3.6298 4.1040 3.6233 3.8849 3.9037 2.0965 3.4149 1.0075 3.8783 0.9838 0.9960 0.9997 1.0077 1.0039 3.9919 3.9503 0.9998 3.9829 1.0031 3.9991 1.0276 3.5762 4.0019 1.0104
dispcorr: -0.016145383 hartree
energy: -1162.105447333497
dipole: 32.23886 -30.98212 1.25675 21.57785 -18.39732 3.18053 1.66911 -2.24209 -0.57298
magnitude: 3.46749 au
magnitude: 8.81366 debye
