program: Gaussian 09
title: 000057688
version: EM64L-G09RevD.01
frameworkgroup: C1[X(C21H15ClN4O4)]
method: RPBEPBE
basis: SDD
operation: Freq
keyword: #p
keyword: freq=noraman
keyword: PBEPBE/SDD
title: #p freq=noraman PBEPBE/SDD
converged: YES YES NO NO
title: Mulliken charges:
elementType: Cl O O O O N N N N C C C C C C C C C C C C C C C C C C C C C H H H H H H H H H H H H H H H
charge: -0.035331 -0.252153 -0.215696 -0.203440 -0.209176 -0.474656 -0.422250 0.071260 0.020958 0.512609 0.287799 -0.474325 -0.339714 -0.338263 -0.363721 0.264045 0.140167 0.167842 0.484866 -0.328028 -0.338693 -0.509496 0.382638 -0.371394 -0.208397 -0.219318 -0.359018 -0.182390 -0.099572 -0.382014 0.224618 0.315751 0.222823 0.275150 0.313926 0.282150 0.220887 0.281285 0.294817 0.264476 0.261232 0.288935 0.243893 0.290570 0.214346
chargesum: 0.00000
title: Mulliken charges with hydrogens summed into heavy atoms:
elementType: Cl O O O O N N N N C C C C C C C C C C C C C C C C C C C C C
charge: -0.035331 -0.252153 -0.215696 -0.203440 -0.209176 -0.160730 -0.131680 0.071260 0.020958 0.512609 0.287799 -0.249707 -0.023962 -0.115441 -0.088572 0.264045 0.140167 0.167842 0.484866 -0.045877 -0.117806 -0.228211 0.382638 -0.076577 0.056078 0.041915 -0.070083 0.061503 -0.099572 -0.167667
polarizability: 6.87302162e+02 1.72005558e+00 2.92088465e+02 1.42898679e+00 4.29570179e+00 1.11360722e+02
1716.lowfreq: -3.1810 -0.0016 0.0007 0.0020 2.1237 2.7194 13.6479 14.9784 17.2600
frequency: 13.6388 14.9296 17.2397 31.1578 36.2398 47.5134 53.5021 65.5088 80.9903 91.7414 96.5862 115.2986 130.8730 159.7161 166.6507 184.1631 208.9827 229.0422 255.8428 264.5111 273.6427 298.8615 312.0946 321.0800 345.8252 374.5799 380.7219 407.5147 410.4906 417.1369 424.7094 447.3576 464.5630 484.8488 516.6413 525.5833 532.2390 535.6412 621.1646 622.3068 631.8744 636.4438 642.2289 649.5865 678.1400 678.6442 681.8666 689.5292 704.0525 713.0304 742.3698 759.4637 774.9796 812.8300 824.5068 827.7685 828.6201 852.1774 855.1596 866.7793 887.4866 908.0271 923.1312 945.1369 950.3883 952.0578 963.2040 986.2515 986.4420 998.7686 1002.5512 1011.4883 1014.6232 1029.7300 1072.8035 1083.7275 1084.2870 1091.2096 1115.0594 1124.4899 1136.9436 1174.6024 1188.8222 1194.5824 1212.6232 1235.9871 1242.5327 1246.0789 1266.9685 1297.5303 1299.6867 1308.8169 1332.0130 1365.5560 1369.0079 1372.2545 1396.6772 1400.8609 1420.9016 1435.6340 1471.5601 1474.5237 1494.7917 1498.9192 1515.0515 1566.3332 1568.5703 1581.2442 1592.1376 1597.2538 1609.8524 1616.7160 1621.0875 1626.7966 2974.7040 3111.6394 3124.6142 3137.4481 3152.0588 3159.4630 3160.4201 3162.2753 3170.9817 3172.3912 3178.4118 3188.5776 3201.0019 3385.8092 3530.8217
redmass: 6.8542 6.2387 7.8869 7.3094 5.5421 8.8467 6.8215 7.0676 7.0867 8.3418 6.8885 9.7881 6.4159 7.3864 7.9131 5.4148 9.3932 3.1865 6.7436 6.1366 6.8503 5.8002 5.7108 8.7222 5.3564 8.2167 7.4515 2.8787 3.0636 6.6160 3.2604 6.4649 5.5648 4.4338 5.2781 3.8485 5.0902 4.0415 3.5505 4.9950 1.7731 4.6754 3.0790 1.7081 4.9973 5.8592 4.2076 2.4040 5.7323 7.0951 3.5226 4.3567 8.0126 2.7845 1.4866 1.9000 1.4369 1.5877 6.6385 5.5389 1.4761 1.4417 4.2071 1.3963 1.3753 1.6119 1.3846 6.2024 1.3814 4.1008 3.2051 1.4076 1.3659 4.0321 4.1292 1.8440 2.5803 1.6190 1.3898 2.1111 2.0589 1.1499 1.1279 1.1651 4.8442 2.4384 2.6520 3.3371 2.0958 1.2775 1.4543 1.4168 1.6702 4.6879 5.2185 10.5353 4.1190 4.8180 4.3812 3.5814 2.2426 2.3317 2.2246 2.2782 2.5098 6.7295 8.0930 5.1189 5.8903 6.1220 4.8379 6.8587 6.8812 7.1545 1.0873 1.0873 1.0895 1.0960 1.0882 1.0889 1.0911 1.0918 1.0948 1.0953 1.0976 1.0967 1.0950 1.0750 1.0759
irintensity: 0.0220 1.5367 0.5684 0.5644 5.6672 2.3781 0.6927 0.5749 6.5772 4.9938 4.6900 0.3350 0.7274 0.9747 4.3455 0.3948 4.8753 25.3734 13.0890 1.9491 0.1372 19.4595 1.0186 0.7863 1.9580 2.3974 0.6504 0.6826 0.1422 3.3097 0.0999 5.4375 26.1619 9.6142 13.8081 22.9810 10.5971 2.2829 19.1753 8.7841 40.0175 3.4979 22.5494 28.0688 19.3230 35.3684 29.0649 48.7793 13.3531 5.2612 23.5598 14.4859 18.7561 34.8697 44.2067 12.0665 31.5226 37.8858 7.6681 45.4384 46.1376 1.8510 47.2515 1.8049 1.1356 56.5334 0.1476 1.6674 6.5405 61.6095 13.7156 1.3297 2.0576 6.6394 26.9231 8.4342 106.7850 30.7369 39.8128 334.1720 127.0521 27.5331 26.3344 256.2988 369.4449 468.3158 333.5612 28.8979 51.9181 2.5126 2.2005 143.9018 14.8056 351.3351 0.4883 71.6151 6.5025 20.9013 23.3397 23.4373 252.1114 161.7693 244.0826 563.9047 49.6985 57.7876 18.5341 80.1741 15.4522 119.5273 95.3634 2.5478 189.2328 118.5539 49.1885 30.5152 16.8555 16.1077 7.5070 0.1458 0.7915 4.0845 6.3323 2.3292 2.6360 3.8706 6.2795 5.5144 12.2323
temp: 298.150 k
press: 1.00000 atm
elementType: 17 8 8 8 8 7 7 7 7 6 6 6 6 6 6 6 6 6 6 6 6 6 6 6 6 6 6 6 6 6 1 1 1 1 1 1 1 1 1 1 1 1 1 1 1
symmnumber: 1
zpe: 846391.3 jmol-1
zpe.correction: 0.322373 hartree
zpe.thermalcorrener: 0.348428 hartree
zpe.thermalcorrenthalpy: 0.349372 hartree
zpe.thermalcorrgfe: 0.260746 hartree
zpe.sumelectzpe: -1787.035134 hartree
zpe.sumelectthermal: -1787.009080 hartree
zpe.sumelectthermalent: -1787.008136 hartree
zpe.sumelectthermalfe: -1787.096762 hartree
dipole: -5.3113 3.1714 1.0826
dipole: 6.2801
quadrupole: -231.6883 -192.0816 -183.8819
quadrupole: -33.9184 -1.2965 1.3553
quadrupole: -29.1377 10.4690 18.6687 -33.9184 -1.2965 1.3553
hfenergy: -1787.3575076 hartree
pointgroup: C01 [X(C21H15Cl1N4O4)]
dipole: 2.0618041 -1.2743934 0.4792164 debye
polarizability: 687.2042416|-6.5568624|291.6229052|0.2936973|-10.9835736|111.9242015 unknown
InChI: InChI=1S/C21H15ClN4O4/c22-17-8-4-15(5-9-17)20(27)24-18-10-6-16(7-11-18)21(28)25-23-13-14-2-1-3-19(12-14)26(29)30/h1-13,24-25H
charge 0 multiplicity 1
45 atoms
Cl 10.850759 -2.272242 0.213485
O  5.453467 1.850475 -0.601338
O  -1.548717 2.778316 -0.022334
O  -10.29376 -1.723297 -0.077089
O  -8.514775 -3.1415 -0.227685
N  4.313595 -0.048874 0.181031
N  -2.1747 0.514692 0.000922
N  -3.518164 0.798365 0.041231
N  -9.025719 -1.95985 -0.1187
C  2.964308 0.385063 0.132475
C  0.205422 1.100507 0.075656
C  1.973109 -0.513668 0.617127
C  2.567788 1.659006 -0.363844
C  0.613502 -0.160863 0.588564
C  1.204276 1.998656 -0.381158
C  6.75386 -0.13005 -0.089805
C  5.467922 0.647005 -0.202516
C  -1.220554 1.564267 0.024755
C  -5.813665 0.045649 -0.002286
C  7.954584 0.621254 -0.003518
C  6.828225 -1.548462 -0.107307
C  -6.70942 -1.049346 -0.081317
C  -8.096358 -0.803684 -0.036191
C  -6.338937 1.366959 0.119644
C  9.204797 -0.020373 0.093066
C  8.073625 -2.206267 -0.017015
C  -8.631438 0.496252 0.08458
C  -7.729936 1.582365 0.161882
C  9.244318 -1.429728 0.090799
C  -4.366776 -0.204401 -0.047616
H  2.271496 -1.486272 1.028947
H  3.328588 2.356301 -0.716786
H  -0.114087 -0.86121 1.016061
H  0.885494 2.980036 -0.747037
H  4.458698 -0.975111 0.588645
H  7.886314 1.713366 -0.021644
H  5.931016 -2.165437 -0.238936
H  -6.353497 -2.08015 -0.17583
H  -5.63333 2.201618 0.178057
H  10.128664 0.559948 0.166761
H  8.134011 -3.297811 -0.042299
H  -9.715143 0.634461 0.115036
H  -8.119588 2.60096 0.254988
H  -1.846658 -0.455626 -0.118059
H  -4.041713 -1.2592 -0.157102
