program: Orca
programVersion: 5.0.2
elementType: H C C C C C C H C O F F F H H C C C N C H C H H C O N F C C H C H C C F C H H
charge: 0
multiplicity: 1
keywords: wb97x-d3
keywords: def2-TZVPP
keywords: def2/J RIJCOSX
keywords: DEFGRID2
keywords: scfconv7
keywords: smallprint printgap noloewdin
keywords: NOSOSCF
formula: C19H11F5N2O2
InChI: InChI=1/C19H11F5N2O2/c20-12-6-7-16(15(21)10-12)26-17(27)14-5-2-8-25-18(14)28-13-4-1-3-11(9-13)19(22,23)24/h1-10,26H
39 atoms
H  -1.13807 -0.706575 -1.683725
C  -1.531767 -0.49569 -0.69725
C  -1.781514 -1.507065 0.218609
C  -1.489209 -2.926015 -0.162477
C  -2.28509 -1.211329 1.479494
C  -2.523496 0.110264 1.818883
C  -2.259545 1.137171 0.924677
H  -2.448814 2.164378 1.209795
C  -1.765593 0.820336 -0.330705
O  -1.510474 1.779472 -1.281611
F  -2.530316 -3.509388 -0.77594
F  -1.196228 -3.682907 0.901248
F  -0.450606 -3.019796 -1.001818
H  -2.915466 0.348924 2.797792
H  1.455115 4.61663 0.677972
C  0.541065 4.447442 0.124976
C  0.168925 3.151505 -0.211236
C  -1.035687 3.004524 -0.906607
N  -1.782916 4.011374 -1.293572
C  -1.385112 5.24468 -0.998753
H  -2.020091 6.049359 -1.347194
C  -0.239458 5.516188 -0.276111
H  0.037582 6.53344 -0.041661
H  -2.484941 -1.989761 2.202679
C  1.062482 2.040937 0.231492
O  1.644937 2.099569 1.301995
N  1.207853 1.018973 -0.63685
F  3.674476 -3.806337 0.327951
C  3.079365 -2.63062 0.096424
C  3.333203 -1.967637 -1.086971
H  4.001049 -2.387532 -1.827161
C  2.723686 -0.742081 -1.29642
H  2.915352 -0.201527 -2.214204
C  1.861436 -0.188602 -0.356771
C  1.616477 -0.913574 0.804357
F  0.750849 -0.446828 1.704216
C  2.224929 -2.126256 1.056125
H  2.022668 -2.665469 1.972882
H  0.852072 1.122118 -1.575613
elementType: H C O F N
totalener: -1490.01276873 hartree
nucrepener: 2758.87530960 hartree
electener: -4248.88807833 hartree
oneelecener: -7532.45737215 hartree
twoeener: 3283.56929382 hartree
cpcmener: -0.04337463 hartree
kineticenergy: 1484.44711322 hartree
xcener: -133.235071585265 hartree
chargesum: -0.0000000
charge: 0.146700 -0.253323 0.008078 0.567331 -0.173798 -0.138527 -0.166162 0.159762 0.237261 -0.309881 -0.183003 -0.186861 -0.183257 0.164623 0.150223 -0.106214 -0.081748 0.277496 -0.322911 0.060791 0.152171 -0.177828 0.161793 0.148047 0.417906 -0.513725 -0.109374 -0.216579 0.294976 -0.166419 0.154874 -0.223077 0.154360 0.092989 0.203886 -0.202442 -0.177745 0.145361 0.194246
qa: 0.1467 -0.2533 0.0081 0.5673 -0.1738 -0.1385 -0.1662 0.1598 0.2373 -0.3099 -0.1830 -0.1869 -0.1833 0.1646 0.1502 -0.1062 -0.0817 0.2775 -0.3229 0.0608 0.1522 -0.1778 0.1618 0.1480 0.4179 -0.5137 -0.1094 -0.2166 0.2950 -0.1664 0.1549 -0.2231 0.1544 0.0930 0.2039 -0.2024 -0.1777 0.1454 0.1942
va: 1.0228 3.9989 3.6078 4.3858 3.9691 3.9088 3.9124 0.9979 3.7985 2.0573 1.1088 1.1108 1.1127 0.9882 1.0149 3.9811 3.6442 4.1424 3.0370 3.9787 0.9947 3.9234 0.9919 1.0078 4.0793 1.9902 3.1584 1.0642 3.8943 3.8901 0.9955 3.9764 1.0050 3.6334 3.9428 1.0826 3.8619 1.0068 0.9987
dispcorr: -0.024088618 hartree
energy: -1490.036857348984
dipole: -0.01351 0.15303 0.13952 25.57528 -23.81900 1.75628 -0.92885 -0.07881 -1.00767
magnitude: 2.02962 au
magnitude: 5.15889 debye
