program: Orca
programVersion: 5.0.2
elementType: H C C C C C C H C O F F F H H C C C N C H C H H C O N F C C H C H C C F C H H
charge: 0
multiplicity: 1
keywords: wb97x-d3
keywords: def2-TZVPP
keywords: def2/J RIJCOSX
keywords: DEFGRID2
keywords: scfconv7
keywords: smallprint printgap noloewdin
keywords: NOSOSCF
formula: C19H11F5N2O2
InChI: InChI=1/C19H11F5N2O2/c20-12-6-7-16(15(21)10-12)26-17(27)14-5-2-8-25-18(14)28-13-4-1-3-11(9-13)19(22,23)24/h1-10,26H
39 atoms
H  -2.281004 -0.140145 -1.369365
C  -1.910022 -0.230564 -0.356752
C  -1.512965 -1.453629 0.168283
C  -1.619089 -2.678316 -0.68502
C  -1.028734 -1.545676 1.466062
C  -0.945572 -0.399119 2.24182
C  -1.330903 0.830309 1.73301
H  -1.257312 1.720859 2.34481
C  -1.80296 0.902884 0.430173
O  -2.190464 2.104623 -0.120856
F  -2.845286 -3.219539 -0.627356
F  -0.758175 -3.629927 -0.311102
F  -1.377169 -2.416536 -1.974911
H  -0.576657 -0.464543 3.255778
H  1.853573 4.155932 -0.359295
C  0.793834 4.193477 -0.141825
C  0.010975 3.063283 -0.306673
C  -1.348576 3.172031 -0.002636
N  -1.921981 4.28576 0.381107
C  -1.162922 5.372571 0.502678
H  -1.672154 6.278446 0.806069
C  0.199109 5.37563 0.273955
H  0.777742 6.278438 0.404023
H  -0.710048 -2.491721 1.880925
C  0.565828 1.800428 -0.88486
O  0.232352 1.422556 -1.993311
N  1.419772 1.150546 -0.063731
F  2.995346 -4.128073 -0.123206
C  2.620487 -2.843208 -0.141173
C  2.200811 -2.273481 -1.322849
H  2.174009 -2.853851 -2.235076
C  1.817704 -0.939649 -1.334976
H  1.503763 -0.503932 -2.268301
C  1.839806 -0.179411 -0.168102
C  2.284745 -0.807789 0.994067
F  2.313837 -0.094928 2.13029
C  2.677399 -2.124564 1.037058
H  3.010517 -2.57252 1.964329
H  1.550725 1.578409 0.84258
elementType: H C O F N
totalener: -1490.01148648 hartree
nucrepener: 2777.74346075 hartree
electener: -4267.75494723 hartree
oneelecener: -7569.64948203 hartree
twoeener: 3301.89453480 hartree
cpcmener: -0.04009464 hartree
kineticenergy: 1484.45508526 hartree
xcener: -133.238865659087 hartree
chargesum: -0.0000000
charge: 0.139973 -0.162469 -0.068770 0.572548 -0.150736 -0.166120 -0.124524 0.163397 0.226135 -0.309916 -0.182862 -0.181778 -0.186679 0.161952 0.161668 -0.111539 -0.070645 0.253466 -0.326590 0.047228 0.151106 -0.176962 0.162657 0.149508 0.401754 -0.484775 -0.117361 -0.218726 0.287216 -0.206588 0.154271 -0.204723 0.157510 0.067452 0.261293 -0.218880 -0.176940 0.148891 0.179559
qa: 0.1400 -0.1625 -0.0688 0.5725 -0.1507 -0.1661 -0.1245 0.1634 0.2261 -0.3099 -0.1829 -0.1818 -0.1867 0.1620 0.1617 -0.1115 -0.0706 0.2535 -0.3266 0.0472 0.1511 -0.1770 0.1627 0.1495 0.4018 -0.4848 -0.1174 -0.2187 0.2872 -0.2066 0.1543 -0.2047 0.1575 0.0675 0.2613 -0.2189 -0.1769 0.1489 0.1796
va: 1.0265 4.0255 3.6550 4.3889 3.8923 3.8370 3.8601 0.9961 3.7400 2.0694 1.1109 1.1141 1.1083 0.9930 1.0029 3.9517 3.6547 4.1768 3.0318 3.9867 0.9951 3.9011 0.9913 1.0084 4.0807 2.0050 3.2523 1.0598 3.8807 3.8892 0.9965 3.8692 1.0334 3.7759 3.8408 1.0664 3.8757 1.0033 1.0183
dispcorr: -0.025927503 hartree
energy: -1490.037413985600
dipole: 3.75937 -1.51421 2.24516 22.91087 -21.24098 1.66989 5.73978 -3.48489 2.25489
magnitude: 3.59358 au
magnitude: 9.13415 debye
