program: Orca
programVersion: 5.0.2
elementType: H C C C C C C H C O F F F H H C C C N C H C H H C O N F C C H C H C C F C H H
charge: 0
multiplicity: 1
keywords: wb97x-d3
keywords: def2-TZVPP
keywords: def2/J RIJCOSX
keywords: DEFGRID2
keywords: scfconv7
keywords: smallprint printgap noloewdin
keywords: NOSOSCF
formula: C19H11F5N2O2
InChI: InChI=1/C19H11F5N2O2/c20-12-6-7-16(15(21)10-12)26-17(27)14-5-2-8-25-18(14)28-13-4-1-3-11(9-13)19(22,23)24/h1-10,26H
39 atoms
H  -2.871954 0.042405 -1.030073
C  -2.247273 -0.155812 -0.169452
C  -1.909278 -1.445128 0.20869
C  -2.364018 -2.619983 -0.600766
C  -1.084365 -1.670113 1.307166
C  -0.618193 -0.590994 2.037641
C  -0.95408 0.707766 1.679126
H  -0.587069 1.543367 2.262501
C  -1.755186 0.911457 0.567536
O  -2.123224 2.173195 0.160775
F  -2.888985 -3.585422 0.163884
F  -1.340192 -3.179924 -1.264318
F  -3.287432 -2.298318 -1.509569
H  0.0139 -0.757448 2.898896
H  1.961963 3.991273 -0.701912
C  0.939986 4.091511 -0.358839
C  0.101642 2.987555 -0.350217
C  -1.207008 3.179417 0.10578
N  -1.6772 4.343917 0.485115
C  -0.86798 5.398663 0.440968
H  -1.299218 6.344124 0.744758
C  0.452218 5.325114 0.042857
H  1.077623 6.205715 0.035443
H  -0.803059 -2.67382 1.597385
C  0.555004 1.673073 -0.894081
O  0.011802 1.176518 -1.865064
N  1.580694 1.122115 -0.208295
F  3.370393 -4.08586 -0.007946
C  2.935453 -2.822426 -0.095593
C  2.047042 -2.474151 -1.089246
H  1.702401 -3.209704 -1.80313
C  1.599872 -1.16322 -1.172788
H  0.908875 -0.905841 -1.956987
C  2.026128 -0.201534 -0.259114
C  2.934726 -0.610949 0.716581
F  3.369638 0.298222 1.602219
C  3.399266 -1.901058 0.822535
H  4.100752 -2.173393 1.600223
H  1.899361 1.655811 0.589003
elementType: H C O F N
totalener: -1490.01153259 hartree
nucrepener: 2718.89778043 hartree
electener: -4208.90931302 hartree
oneelecener: -7451.77268612 hartree
twoeener: 3242.86337310 hartree
cpcmener: -0.04020032 hartree
kineticenergy: 1484.43408497 hartree
xcener: -133.235654157381 hartree
chargesum: 0.0000000
charge: 0.142557 -0.205418 -0.025042 0.559809 -0.193553 -0.148675 -0.166736 0.168395 0.293746 -0.300772 -0.184634 -0.179214 -0.180523 0.163312 0.161370 -0.093994 -0.095813 0.279237 -0.335695 0.054038 0.151389 -0.193124 0.162084 0.150746 0.374351 -0.479768 -0.101978 -0.218999 0.280497 -0.187277 0.152908 -0.206145 0.157608 0.049336 0.265835 -0.219699 -0.178487 0.149937 0.178389
qa: 0.1426 -0.2054 -0.0250 0.5598 -0.1936 -0.1487 -0.1667 0.1684 0.2937 -0.3008 -0.1846 -0.1792 -0.1805 0.1633 0.1614 -0.0940 -0.0958 0.2792 -0.3357 0.0540 0.1514 -0.1931 0.1621 0.1507 0.3744 -0.4798 -0.1020 -0.2190 0.2805 -0.1873 0.1529 -0.2061 0.1576 0.0493 0.2658 -0.2197 -0.1785 0.1499 0.1784
va: 1.0241 4.0243 3.6431 4.4111 3.9423 3.8478 3.8997 0.9918 3.7007 2.0832 1.1151 1.1065 1.1235 0.9894 1.0035 3.9327 3.6408 4.1510 3.0355 3.9843 0.9951 3.9154 0.9919 1.0074 4.1289 2.0109 3.2389 1.0607 3.9036 3.8954 0.9993 3.8451 1.0385 3.8166 3.8489 1.0652 3.8873 1.0025 1.0195
dispcorr: -0.024223718 hartree
energy: -1490.035756304074
dipole: 6.35418 -3.70662 2.64756 21.43193 -19.77941 1.65252 4.93695 -3.17940 1.75754
magnitude: 3.58181 au
magnitude: 9.10423 debye
