program: Gaussian 09
title: 000057683
version: EM64L-G09RevD.01
frameworkgroup: C1[X(C24H23N3O5)]
method: RPBEPBE
basis: SDD
operation: Freq
keyword: #p
keyword: freq=noraman
keyword: PBEPBE/SDD
title: #p freq=noraman PBEPBE/SDD
converged: YES YES NO NO
title: Mulliken charges:
elementType: O O O O O N N N C C C C C C C C C C C C C C C C C C C C C C C C H H H H H H H H H H H H H H H H H H H H H H H
charge: -0.243346 -0.232280 -0.255902 -0.265759 -0.234849 -0.474923 -0.417413 0.057730 0.507066 0.284672 0.258225 -0.364206 -0.458310 -0.352719 -0.349969 0.128358 0.492449 0.226238 -0.347155 -0.327188 0.202995 -0.521483 -0.416026 0.162614 0.332673 -0.318112 -0.365513 -0.351412 -0.398050 -0.537465 -0.538302 -0.537213 0.311360 0.222101 0.311223 0.216504 0.274100 0.211423 0.276584 0.236975 0.281149 0.245186 0.244693 0.257938 0.199716 0.284916 0.219040 0.219020 0.248227 0.223069 0.223101 0.247386 0.251164 0.225248 0.224449
chargesum: 0.00000
title: Mulliken charges with hydrogens summed into heavy atoms:
elementType: O O O O O N N N C C C C C C C C C C C C C C C C C C C C C C C C
charge: -0.243346 -0.232280 -0.255902 -0.265759 -0.234849 -0.163700 -0.132496 0.057730 0.507066 0.284672 0.258225 -0.052846 -0.236209 -0.136215 -0.075870 0.128358 0.492449 0.226238 -0.135731 -0.050604 0.202995 -0.284508 -0.134877 0.162614 0.332673 -0.072926 -0.120819 -0.093474 -0.198335 0.148822 0.155255 0.163648
polarizability: 7.67213811e+02 -7.37687894e+00 3.09634986e+02 9.49548237e+00 -3.56431392e+00 1.37339160e+02
1716.lowfreq: -3.9561 -1.4866 -0.0014 0.0014 0.0020 3.1615 10.0041 13.6558 18.7315
frequency: 9.8992 13.2967 18.6303 30.5269 35.4344 46.0540 54.0160 71.5224 73.7505 84.8449 89.4792 95.7260 123.6113 134.8245 142.9419 157.7164 165.2959 169.4349 186.4009 205.6362 220.7368 225.3416 228.7565 242.5354 259.8558 269.6366 284.1187 292.7193 310.7563 329.9400 347.1538 365.7375 378.7109 396.7793 410.1207 413.8662 422.6132 441.3919 460.9979 466.7472 469.2993 495.7813 509.5862 529.4306 578.6390 588.8398 609.0937 619.3525 625.9906 628.0796 634.6392 640.2810 654.7596 680.5598 685.9124 731.1537 743.1017 754.7900 758.7763 765.7006 770.5480 807.2403 823.4036 824.1657 842.0636 849.8744 854.8931 859.4080 861.7782 871.9945 934.1058 935.2893 935.7436 962.2312 976.2625 979.7366 982.7514 986.8996 988.4052 999.4582 1000.4922 1004.5858 1029.5252 1081.8019 1110.6376 1111.7735 1113.3677 1117.0096 1122.2324 1126.1414 1133.1413 1147.0050 1156.1626 1158.0552 1182.8629 1187.9449 1190.9016 1227.8634 1239.5569 1245.7998 1249.2748 1262.9626 1266.3742 1292.8245 1303.5707 1311.0529 1334.3505 1363.5005 1374.1354 1388.4583 1415.7569 1417.9505 1426.5340 1436.6880 1437.6939 1442.6406 1467.3586 1467.7846 1468.9106 1469.8375 1471.0325 1471.1742 1483.9741 1496.3989 1503.3283 1510.0922 1518.8810 1563.7295 1566.6698 1581.0595 1592.2899 1605.9163 1608.4535 1615.8054 1618.4530 1624.6703 2947.0126 2955.0287 2961.4296 2966.0424 3041.4558 3050.9660 3057.0005 3113.1831 3115.1894 3123.5173 3125.2064 3128.5121 3131.6970 3140.3749 3154.8012 3155.9887 3163.5969 3165.5377 3174.7439 3176.1029 3197.2452 3385.6476 3532.7423
redmass: 5.7542 4.5798 5.4662 5.7735 4.2694 5.8403 4.8887 5.1342 6.5715 4.0861 4.1353 3.3710 4.6774 5.0164 4.8981 3.9591 4.5066 4.3439 4.7333 5.2470 1.3883 1.8127 1.6589 2.0367 1.8087 4.3003 4.8884 3.2502 4.2292 5.6929 5.3862 4.0895 7.4109 4.8221 2.9945 2.9476 5.9952 6.8821 3.1298 4.7143 5.3153 5.0174 3.2713 3.0151 4.4234 5.6716 1.6564 5.1064 4.2726 3.5095 3.5928 1.6422 3.6391 4.5877 3.8242 5.2146 2.8118 4.3065 4.3698 5.9658 5.6458 1.5139 3.8377 1.4898 1.3188 1.6351 1.7214 1.9684 4.9437 4.8172 4.6631 1.4019 1.5218 1.3964 1.3792 8.3294 7.4118 1.3551 1.4268 2.7347 4.2482 3.2202 5.2367 3.3324 1.2608 1.2615 1.2591 1.3626 2.5678 1.4892 2.0788 1.5265 1.3238 1.3992 1.2807 1.3250 1.4043 1.9681 2.8988 2.7871 2.8416 2.2968 2.3165 1.7280 1.2834 1.4671 2.0909 4.5052 5.3023 3.1474 3.6923 4.5759 4.1659 1.2031 1.1750 1.3597 1.0521 1.0514 1.0593 1.0847 1.0848 1.0604 2.0518 2.0131 2.4830 2.8671 2.5003 7.7254 6.7932 5.3373 6.1130 4.8717 6.5615 6.3090 6.4627 6.5310 1.0858 1.0336 1.0329 1.0328 1.1037 1.1041 1.1043 1.0900 1.0891 1.0900 1.0988 1.0995 1.0998 1.0902 1.0874 1.0883 1.0944 1.0934 1.0964 1.0973 1.0944 1.0749 1.0757
irintensity: 0.8742 0.9151 0.9932 0.6519 0.6493 3.1514 1.2569 10.9002 5.4331 2.4199 9.6440 3.0980 3.3617 3.1431 2.2930 2.1035 0.6772 4.7044 9.2463 6.4311 5.6355 6.4589 5.4810 8.8596 7.4335 3.4951 0.0561 4.2131 3.4727 9.0143 0.6779 19.4300 8.3400 0.4134 0.3022 0.2544 11.2937 8.4902 1.0968 0.3759 12.9037 3.4112 10.4652 31.6050 11.3320 43.1060 28.1203 1.0041 19.8630 42.2999 3.0819 23.9333 16.8631 36.6955 22.3438 26.0803 2.4049 2.3880 32.8253 3.5404 8.2902 25.7925 21.3228 30.1010 9.4334 20.2132 51.1237 36.9459 22.1848 31.5872 55.5574 1.0185 37.5834 8.0949 7.7456 68.3505 67.3966 4.7618 3.4405 12.3808 67.6125 2.1287 1.9790 72.8426 0.2961 0.2748 0.1896 34.4931 213.9952 68.7432 227.2635 9.5002 13.8330 4.8523 282.7667 118.8895 138.9822 115.1520 266.4475 757.2796 180.4002 279.5933 9.5461 133.9180 8.0448 57.2883 1.6848 344.5348 2.2368 13.9636 9.5874 14.6214 20.2409 25.0349 14.5518 12.8267 12.4803 30.6592 44.6983 161.3099 85.9134 36.2412 186.7833 945.6347 127.3061 79.2189 37.8608 9.3245 133.7590 73.1696 3.9534 138.7989 102.2292 191.5505 274.3200 28.0628 60.1668 76.2424 83.8028 73.3521 49.3715 47.8994 44.0965 34.8758 22.0448 23.0264 27.3133 28.8120 22.7649 9.8646 9.1287 0.7284 3.2489 12.0238 8.1760 7.1920 7.4137 20.4363 11.7517
temp: 298.150 k
press: 1.00000 atm
elementType: 8 8 8 8 8 7 7 7 6 6 6 6 6 6 6 6 6 6 6 6 6 6 6 6 6 6 6 6 6 6 6 6 1 1 1 1 1 1 1 1 1 1 1 1 1 1 1 1 1 1 1 1 1 1 1
symmnumber: 1
zpe: 1115559.9 jmol-1
zpe.correction: 0.424894 hartree
zpe.thermalcorrener: 0.455137 hartree
zpe.thermalcorrenthalpy: 0.456081 hartree
zpe.thermalcorrgfe: 0.359280 hartree
zpe.sumelectzpe: -1466.394993 hartree
zpe.sumelectthermal: -1466.364750 hartree
zpe.sumelectthermalent: -1466.363806 hartree
zpe.sumelectthermalfe: -1466.460607 hartree
dipole: 4.8646 0.1733 1.1561
dipole: 5.0031
quadrupole: -105.6982 -177.0191 -193.1871
quadrupole: -34.0900 5.0402 1.5974
quadrupole: 52.9366 -18.3843 -34.5523 -34.0900 5.0402 1.5974
hfenergy: -1466.8198872 hartree
pointgroup: C01 [X(C24H23N3O5)]
dipole: -1.9139161 0.0618963 -0.455557 debye
polarizability: 767.0308867|11.1135781|309.5429294|10.3709382|7.5657357|137.6141409 unknown
InChI: InChI=1S/C24H23N3O5/c1-30-20-11-7-17(8-12-20)23(28)26-19-9-5-18(6-10-19)24(29)27-25-15-16-4-13-21(31-2)22(14-16)32-3/h4-15,26-27H,1-3H3
charge 0 multiplicity 1
55 atoms
O  8.834735 2.37898 -0.133266
O  9.997209 0.017761 0.130315
O  -10.826799 0.631476 -0.133429
O  -4.539919 1.830657 0.494219
O  1.627663 -2.827451 -0.125794
N  -4.38424 -0.415478 -0.173311
N  2.159367 -0.539288 -0.1213
N  3.523117 -0.756176 -0.051685
C  -2.983907 -0.631319 -0.131687
C  -0.192396 -1.220761 -0.104602
C  -6.597025 0.614454 0.08294
C  -2.055536 0.341914 0.329403
C  -2.504175 -1.901492 -0.562349
C  -0.68067 0.036456 0.340327
C  -1.132213 -2.189834 -0.543789
C  -5.103202 0.741126 0.162763
C  5.762795 0.178647 -0.057349
C  7.969608 1.28059 -0.068633
C  -7.297315 -0.617285 0.144922
C  -7.349626 1.817559 -0.023635
C  8.602495 0.001962 0.074873
C  6.565011 1.35495 -0.13328
C  6.397837 -1.080479 0.084853
C  1.257201 -1.62084 -0.108604
C  -9.435012 0.547917 -0.052054
C  7.801831 -1.163538 0.149748
C  -8.706206 -0.661946 0.07882
C  -8.748302 1.790493 -0.096924
C  4.304977 0.3030 -0.128317
C  8.225801 3.702315 -0.2753
C  10.678648 -1.272188 0.27585
C  -11.594082 -0.618473 -0.08605
H  -2.424615 1.309896 0.671023
H  -3.214225 -2.663107 -0.910304
H  -4.932573 -1.198814 -0.534547
H  0.003318 0.792155 0.746358
H  -0.755228 -3.168057 -0.858514
H  -6.763256 -1.56429 0.294645
H  -6.803861 2.766089 -0.041503
H  6.07252 2.327391 -0.243388
H  5.777363 -1.979479 0.142386
H  8.273303 -2.144447 0.259858
H  -9.217909 -1.626332 0.144273
H  -9.334824 2.709431 -0.186591
H  3.897234 1.329982 -0.24784
H  1.790674 0.415675 -0.243951
H  7.646859 3.782854 -1.216573
H  7.570247 3.940488 0.585618
H  9.072805 4.403252 -0.300751
H  10.392439 -1.774179 1.220335
H  10.463543 -1.939576 -0.581036
H  11.749767 -1.02446 0.295527
H  -12.64583 -0.31089 -0.174445
H  -11.438687 -1.147179 0.87391
H  -11.326835 -1.284215 -0.929064
