program: Orca
programVersion: 5.0.2
elementType: H C C C C C C H C O F F F H H C C C N C H C H H C O N F C C H C H C C F C H H
charge: 0
multiplicity: 1
keywords: wb97x-d3
keywords: def2-TZVPP
keywords: def2/J RIJCOSX
keywords: DEFGRID2
keywords: scfconv7
keywords: smallprint printgap noloewdin
keywords: NOSOSCF
formula: C19H11F5N2O2
InChI: InChI=1/C19H11F5N2O2/c20-12-6-7-16(15(21)10-12)26-17(27)14-5-2-8-25-18(14)28-13-4-1-3-11(9-13)19(22,23)24/h1-10,26H
39 atoms
H  -1.765761 -1.197069 -0.711479
C  -2.453521 -0.708144 -0.031645
C  -3.666982 -1.292609 0.318516
C  -4.012879 -2.617341 -0.286958
C  -4.535645 -0.645909 1.183405
C  -4.172842 0.585312 1.714892
C  -2.961295 1.170903 1.392788
H  -2.680252 2.11902 1.831129
C  -2.111709 0.514654 0.512031
O  -0.860543 0.994947 0.216381
F  -5.067294 -3.192058 0.295366
F  -2.996569 -3.485663 -0.194694
F  -4.298974 -2.501718 -1.592554
H  -4.84311 1.090121 2.397381
H  1.8091 4.354613 -1.053792
C  0.811132 3.94648 -0.957852
C  0.639318 2.662223 -0.464712
C  -0.682227 2.215169 -0.33299
N  -1.729888 2.910195 -0.69683
C  -1.5403 4.125115 -1.202332
H  -2.431957 4.662337 -1.503246
C  -0.290696 4.695983 -1.342818
H  -0.180042 5.693272 -1.743622
H  -5.485412 -1.0830 1.458737
C  1.848904 1.883165 -0.062811
O  2.762996 2.414335 0.541302
N  1.880641 0.591152 -0.457729
F  5.797058 -2.986576 1.019908
C  4.846902 -2.112808 0.669885
C  3.550061 -2.32781 1.092188
H  3.301356 -3.185814 1.701847
C  2.580574 -1.408852 0.726433
H  1.558593 -1.548128 1.055117
C  2.888832 -0.307069 -0.061645
C  4.205609 -0.146999 -0.472751
F  4.520643 0.879295 -1.263087
C  5.202807 -1.029372 -0.109383
H  6.222679 -0.880606 -0.440667
H  1.073062 0.194064 -0.913718
elementType: H C O F N
totalener: -1490.02388646 hartree
nucrepener: 2514.70109343 hartree
electener: -4004.72497989 hartree
oneelecener: -7043.59503008 hartree
twoeener: 3038.87005020 hartree
cpcmener: -0.03355831 hartree
kineticenergy: 1484.45304335 hartree
xcener: -133.232254525876 hartree
chargesum: 0.0000000
charge: 0.143957 -0.240493 -0.008321 0.559010 -0.160243 -0.125620 -0.191580 0.149474 0.277940 -0.317023 -0.179322 -0.184108 -0.182291 0.162056 0.147393 -0.102217 -0.086690 0.421934 -0.385879 0.033865 0.145207 -0.183388 0.159194 0.153886 0.376284 -0.489190 -0.171984 -0.213481 0.280206 -0.166016 0.153427 -0.201716 0.155625 0.095293 0.215550 -0.204352 -0.170628 0.146477 0.187765
qa: 0.1440 -0.2405 -0.0083 0.5590 -0.1602 -0.1256 -0.1916 0.1495 0.2779 -0.3170 -0.1793 -0.1841 -0.1823 0.1621 0.1474 -0.1022 -0.0867 0.4219 -0.3859 0.0339 0.1452 -0.1834 0.1592 0.1539 0.3763 -0.4892 -0.1720 -0.2135 0.2802 -0.1660 0.1534 -0.2017 0.1556 0.0953 0.2155 -0.2044 -0.1706 0.1465 0.1878
va: 1.0206 4.1369 3.6705 4.4213 3.9540 3.9152 4.0277 1.0041 3.7298 2.0994 1.1244 1.1142 1.1094 0.9894 1.0107 3.9769 3.6638 3.9153 3.0206 4.0303 0.9938 3.8963 0.9930 1.0065 4.1609 2.0314 3.1634 1.0680 3.9006 3.8890 0.9966 3.9606 1.0012 3.6299 4.0318 1.0906 3.8613 1.0043 1.0039
dispcorr: -0.018023095 hartree
energy: -1490.041909554766
dipole: -1.17014 -0.23534 -1.40548 19.96915 -19.37610 0.59305 3.67037 -3.96663 -0.29626
magnitude: 1.55398 au
magnitude: 3.94989 debye
