program: Orca
programVersion: 5.0.2
elementType: H C C C C C C H C O F F F H H C C C N C H C H H C O N F C C H C H C C F C H H
charge: 0
multiplicity: 1
keywords: wb97x-d3
keywords: def2-TZVPP
keywords: def2/J RIJCOSX
keywords: DEFGRID2
keywords: scfconv7
keywords: smallprint printgap noloewdin
keywords: NOSOSCF
formula: C19H11F5N2O2
InChI: InChI=1/C19H11F5N2O2/c20-12-6-7-16(15(21)10-12)26-17(27)14-5-2-8-25-18(14)28-13-4-1-3-11(9-13)19(22,23)24/h1-10,26H
39 atoms
H  -2.82104 0.478624 1.039654
C  -2.71272 -0.352701 0.356105
C  -3.736408 -1.272702 0.175173
C  -5.003134 -1.110441 0.956559
C  -3.576581 -2.357118 -0.679048
C  -2.382466 -2.512855 -1.363091
C  -1.358379 -1.590907 -1.211335
H  -0.425476 -1.708008 -1.747774
C  -1.535043 -0.519704 -0.352986
O  -0.463418 0.320186 -0.170605
F  -5.330206 0.175462 1.125603
F  -4.899428 -1.644852 2.182736
F  -6.042521 -1.706324 0.362686
H  -2.249536 -3.356204 -2.026957
H  1.286052 4.442387 -0.060647
C  0.449681 3.79255 -0.281218
C  0.583686 2.421763 -0.105002
C  -0.553243 1.64978 -0.389325
N  -1.677012 2.141179 -0.844695
C  -1.771382 3.452897 -1.031902
H  -2.716899 3.813165 -1.419291
C  -0.738918 4.326285 -0.752706
H  -0.855638 5.389385 -0.905838
H  -4.367259 -3.081528 -0.817505
C  1.905998 1.915434 0.375719
O  2.611697 2.619624 1.076903
N  2.268398 0.691058 -0.071147
F  6.864001 -2.291148 0.543657
C  5.755716 -1.547964 0.426664
C  5.709961 -0.294941 0.997033
H  6.559058 0.091869 1.544404
C  4.564458 0.477218 0.85965
H  4.546309 1.457364 1.305092
C  3.458886 0.00107 0.155959
C  3.562262 -1.280176 -0.388339
F  2.509807 -1.763445 -1.068492
C  4.683745 -2.066806 -0.273173
H  4.716143 -3.052436 -0.719476
H  1.59713 0.203849 -0.645152
elementType: H C O F N
totalener: -1490.02531300 hartree
nucrepener: 2517.88777888 hartree
electener: -4007.91309187 hartree
oneelecener: -7049.69172852 hartree
twoeener: 3041.77863664 hartree
cpcmener: -0.02546877 hartree
kineticenergy: 1484.45387508 hartree
xcener: -133.239295673024 hartree
chargesum: 0.0000000
charge: 0.139328 -0.180318 -0.017191 0.555706 -0.173342 -0.118965 -0.217912 0.149121 0.274598 -0.325339 -0.181829 -0.181828 -0.181159 0.161720 0.144609 -0.091346 -0.090105 0.417881 -0.384293 0.042237 0.145116 -0.185060 0.158768 0.150787 0.400117 -0.495246 -0.132769 -0.218004 0.275497 -0.194784 0.151106 -0.186118 0.162638 0.081616 0.232939 -0.218474 -0.187015 0.148734 0.168578
qa: 0.1393 -0.1803 -0.0172 0.5557 -0.1733 -0.1190 -0.2179 0.1491 0.2746 -0.3253 -0.1818 -0.1818 -0.1812 0.1617 0.1446 -0.0913 -0.0901 0.4179 -0.3843 0.0422 0.1451 -0.1851 0.1588 0.1508 0.4001 -0.4952 -0.1328 -0.2180 0.2755 -0.1948 0.1511 -0.1861 0.1626 0.0816 0.2329 -0.2185 -0.1870 0.1487 0.1686
va: 1.0262 4.0853 3.6845 4.4211 3.9847 3.9097 4.0361 1.0076 3.7449 2.0982 1.1189 1.1069 1.1202 0.9894 1.0160 3.9666 3.7092 3.9060 3.0198 4.0239 0.9934 3.9086 0.9937 1.0077 4.0843 2.0157 3.2572 1.0619 3.9176 3.9304 0.9983 3.8943 1.0315 3.8517 3.8754 1.0677 3.9015 1.0033 1.0386
dispcorr: -0.017868791 hartree
energy: -1490.043181786408
dipole: 11.30193 -11.22530 0.07664 11.26854 -11.23203 0.03652 -7.47159 5.89640 -1.57520
magnitude: 1.57748 au
magnitude: 4.00964 debye
