program: Orca
programVersion: 5.0.2
elementType: H C C C C C C H C O F F F H H C C C N C H C H H C O N F C C H C H C C F C H H
charge: 0
multiplicity: 1
keywords: wb97x-d3
keywords: def2-TZVPP
keywords: def2/J RIJCOSX
keywords: DEFGRID2
keywords: scfconv7
keywords: smallprint printgap noloewdin
keywords: NOSOSCF
formula: C19H11F5N2O2
InChI: InChI=1/C19H11F5N2O2/c20-12-6-7-16(15(21)10-12)26-17(27)14-5-2-8-25-18(14)28-13-4-1-3-11(9-13)19(22,23)24/h1-10,26H
39 atoms
H  -1.444384 -0.244928 1.573241
C  -1.555624 -0.325748 0.499884
C  -1.580899 -1.552652 -0.141795
C  -1.505191 -2.823419 0.64602
C  -1.707579 -1.626402 -1.52542
C  -1.829633 -0.457695 -2.256434
C  -1.821516 0.78151 -1.630299
H  -1.938314 1.684679 -2.216948
C  -1.667636 0.834472 -0.25417
O  -1.660721 2.012368 0.443742
F  -1.162892 -2.623626 1.921315
F  -0.61643 -3.682888 0.131313
F  -2.688502 -3.455466 0.65383
H  -1.940402 -0.506624 -3.33131
H  1.55218 4.422491 -1.700403
C  0.608327 4.370936 -1.172358
C  0.156007 3.147983 -0.694325
C  -1.087581 3.139219 -0.052979
N  -1.795189 4.22271 0.166477
C  -1.321805 5.389893 -0.250343
H  -1.930198 6.258929 -0.029245
C  -0.130473 5.518083 -0.94171
H  0.209644 6.484847 -1.284432
H  -1.717041 -2.580698 -2.036104
C  0.982432 1.931344 -0.957301
O  1.376356 1.678522 -2.080592
N  1.253232 1.190394 0.142476
F  3.000859 -4.011588 0.657362
C  2.597453 -2.743768 0.505152
C  2.515418 -2.202803 -0.759169
H  2.775877 -2.791744 -1.62854
C  2.094521 -0.889801 -0.912702
H  2.031975 -0.481472 -1.907298
C  1.752206 -0.113091 0.192744
C  1.864389 -0.711601 1.44664
F  1.534942 0.017088 2.525043
C  2.278443 -2.010447 1.631334
H  2.345772 -2.433969 2.62542
H  0.962835 1.581166 1.027941
elementType: H C O F N
totalener: -1490.01955176 hartree
nucrepener: 2761.12802922 hartree
electener: -4251.14758097 hartree
oneelecener: -7536.18712605 hartree
twoeener: 3285.03954508 hartree
cpcmener: -0.02979021 hartree
kineticenergy: 1484.43501184 hartree
xcener: -133.236071907974 hartree
chargesum: -0.0000000
charge: 0.140308 -0.240362 -0.012836 0.577375 -0.199294 -0.131943 -0.169813 0.162815 0.290416 -0.293628 -0.184156 -0.184222 -0.181309 0.161837 0.152829 -0.104465 -0.079884 0.306528 -0.327192 0.058361 0.149145 -0.189227 0.158096 0.146219 0.347486 -0.467428 -0.088553 -0.217908 0.280423 -0.182984 0.151250 -0.213264 0.158463 0.059006 0.253550 -0.220184 -0.181524 0.146059 0.170011
qa: 0.1403 -0.2404 -0.0128 0.5774 -0.1993 -0.1319 -0.1698 0.1628 0.2904 -0.2936 -0.1842 -0.1842 -0.1813 0.1618 0.1528 -0.1045 -0.0799 0.3065 -0.3272 0.0584 0.1491 -0.1892 0.1581 0.1462 0.3475 -0.4674 -0.0886 -0.2179 0.2804 -0.1830 0.1513 -0.2133 0.1585 0.0590 0.2535 -0.2202 -0.1815 0.1461 0.1700
va: 1.0309 3.9491 3.6567 4.3778 3.9927 3.8983 3.8956 0.9943 3.7242 2.0862 1.1146 1.1095 1.1146 0.9892 1.0098 3.9599 3.6663 4.1119 3.0464 3.9840 0.9948 3.9166 0.9932 1.0086 4.1436 2.0258 3.2105 1.0614 3.8846 3.9149 0.9971 3.8700 1.0340 3.7950 3.8335 1.0630 3.8727 1.0038 1.0273
dispcorr: -0.024867831 hartree
energy: -1490.044419589059
dipole: 0.81406 -0.33940 0.47467 23.50422 -21.73893 1.76529 -13.85659 13.34591 -0.51068
magnitude: 1.89799 au
magnitude: 4.82430 debye
