program: Orca
programVersion: 5.0.2
elementType: H C C C C C C H C O F F F H H C C C N C H C H H C O N F C C H C H C C F C H H
charge: 0
multiplicity: 1
keywords: wb97x-d3
keywords: def2-TZVPP
keywords: def2/J RIJCOSX
keywords: DEFGRID2
keywords: scfconv7
keywords: smallprint printgap noloewdin
keywords: NOSOSCF
formula: C19H11F5N2O2
InChI: InChI=1/C19H11F5N2O2/c20-12-6-7-16(15(21)10-12)26-17(27)14-5-2-8-25-18(14)28-13-4-1-3-11(9-13)19(22,23)24/h1-10,26H
39 atoms
H  -2.853732 0.415444 1.152012
C  -2.675742 -0.374141 0.438092
C  -3.639455 -1.334529 0.176675
C  -4.960575 -1.316701 0.885322
C  -3.399286 -2.353185 -0.73942
C  -2.18463 -2.40948 -1.395594
C  -1.213384 -1.450253 -1.152791
H  -0.259533 -1.489548 -1.661819
C  -1.469343 -0.44148 -0.242573
O  -0.432013 0.425998 0.014914
F  -5.134131 -0.217631 1.621178
F  -5.085678 -2.368196 1.703504
F  -5.974708 -1.383142 0.015718
H  -1.989247 -3.201694 -2.104716
H  1.37739 4.51956 -0.174519
C  0.496422 3.894271 -0.217194
C  0.654885 2.520678 -0.079501
C  -0.530511 1.767509 -0.145959
N  -1.717189 2.277254 -0.346392
C  -1.835983 3.590432 -0.482833
H  -2.839849 3.962336 -0.649753
C  -0.756554 4.449072 -0.415386
H  -0.888217 5.515853 -0.522503
H  -4.153934 -3.101183 -0.941949
C  2.069323 2.029933 0.074414
O  2.982896 2.82859 0.06831
N  2.237728 0.689707 0.193726
F  6.758493 -2.454723 0.382033
C  5.68347 -1.663391 0.34502
C  5.838042 -0.294469 0.304679
H  6.827506 0.141035 0.306139
C  4.718198 0.524463 0.261256
H  4.845667 1.593214 0.229934
C  3.435125 -0.02098 0.254485
C  3.338922 -1.41203 0.300103
F  2.111293 -1.959399 0.292199
C  4.430522 -2.246554 0.34641
H  4.304326 -3.319963 0.380719
H  1.397043 0.133182 0.212631
totalener: -1490.00815297 hartree
nucrepener: 2524.23804241 hartree
electener: -4014.24619538 hartree
oneelecener: -7062.16463897 hartree
twoeener: 3047.91844359 hartree
kineticenergy: 1484.49067479 hartree
xcener: -133.246031652659 hartree
chargesum: 0.0000000
charge: 0.125188 -0.146921 -0.042050 0.549194 -0.162551 -0.096558 -0.205543 0.120689 0.310426 -0.310520 -0.172644 -0.170539 -0.172549 0.131833 0.146987 -0.061032 -0.142380 0.375222 -0.345644 0.038037 0.123613 -0.146963 0.130687 0.123879 0.382152 -0.422086 -0.176470 -0.199287 0.264708 -0.164261 0.125578 -0.153262 0.159054 0.077543 0.216090 -0.214092 -0.186055 0.126583 0.163947
qa: 0.1252 -0.1469 -0.0421 0.5492 -0.1626 -0.0966 -0.2055 0.1207 0.3104 -0.3105 -0.1726 -0.1705 -0.1725 0.1318 0.1470 -0.0610 -0.1424 0.3752 -0.3456 0.0380 0.1236 -0.1470 0.1307 0.1239 0.3822 -0.4221 -0.1765 -0.1993 0.2647 -0.1643 0.1256 -0.1533 0.1591 0.0775 0.2161 -0.2141 -0.1861 0.1266 0.1639
va: 1.0391 4.0446 3.8051 4.4309 4.0678 3.9465 4.1075 1.0220 3.7170 2.0938 1.1344 1.1285 1.1292 0.9995 1.0243 3.9671 3.7693 3.9264 3.0468 4.0504 0.9971 3.8969 1.0042 1.0166 4.1086 2.0890 3.2505 1.0891 3.9705 3.9242 1.0069 3.9189 1.0348 3.8978 3.8871 1.0728 3.9213 1.0107 1.0760
dispcorr: -0.017933264 hartree
energy: -1490.026086231383
dipole: 12.08055 -12.25568 -0.17512 12.95461 -12.71899 0.23562 -8.04172 7.40411 -0.63761
magnitude: 0.70195 au
magnitude: 1.78421 debye
