program: Orca
programVersion: 5.0.2
elementType: H C C C C C C H C O F F F H H C C C N C H C H H C O N F C C H C H C C F C H H
charge: 0
multiplicity: 1
keywords: wb97x-d3
keywords: def2-TZVPP
keywords: def2/J RIJCOSX
keywords: DEFGRID2
keywords: scfconv7
keywords: smallprint printgap noloewdin
keywords: NOSOSCF
formula: C19H11F5N2O2
InChI: InChI=1/C19H11F5N2O2/c20-12-6-7-16(15(21)10-12)26-17(27)14-5-2-8-25-18(14)28-13-4-1-3-11(9-13)19(22,23)24/h1-10,26H
39 atoms
H  -2.805671 0.530305 0.904144
C  -2.704984 -0.343092 0.278553
C  -3.740598 -1.256176 0.169665
C  -5.046428 -0.984941 0.857035
C  -3.604309 -2.392514 -0.619982
C  -2.420724 -2.608028 -1.302093
C  -1.382942 -1.691409 -1.22001
H  -0.45714 -1.854485 -1.7562
C  -1.535874 -0.565429 -0.432807
O  -0.4463 0.26651 -0.328591
F  -5.576934 -2.093604 1.380199
F  -5.946662 -0.491864 -0.002256
F  -4.920297 -0.099909 1.84917
H  -2.302977 -3.493216 -1.911718
H  1.260619 4.394597 0.017338
C  0.420377 3.757618 -0.221407
C  0.589158 2.380618 -0.136641
C  -0.548382 1.613011 -0.4345
N  -1.69607 2.115218 -0.809412
C  -1.823941 3.430651 -0.898422
H  -2.793783 3.793395 -1.217743
C  -0.793963 4.3021 -0.602724
H  -0.93358 5.370939 -0.672016
H  -4.410064 -3.109017 -0.702347
C  1.9618 1.906967 0.250151
O  2.771281 2.705795 0.671906
N  2.234611 0.591387 0.054211
F  6.991628 -2.167913 0.457946
C  5.84859 -1.480736 0.386636
C  5.763771 -0.227223 0.953269
H  6.616726 0.199447 1.46238
C  4.578301 0.487695 0.865928
H  4.521949 1.467704 1.307895
C  3.468441 -0.042425 0.208927
C  3.608128 -1.317811 -0.337636
F  2.552716 -1.855778 -0.973233
C  4.770103 -2.050603 -0.262289
H  4.831425 -3.034544 -0.706419
H  1.481987 0.014605 -0.286173
totalener: -1490.00795036 hartree
nucrepener: 2516.75405394 hartree
electener: -4006.76200430 hartree
oneelecener: -7047.17936680 hartree
twoeener: 3040.41736250 hartree
kineticenergy: 1484.48519711 hartree
xcener: -133.244700622122 hartree
chargesum: -0.0000000
charge: 0.122059 -0.133019 -0.046335 0.541830 -0.165366 -0.092403 -0.211550 0.127075 0.301316 -0.318786 -0.173030 -0.168049 -0.174241 0.131847 0.145690 -0.065510 -0.140202 0.383821 -0.343434 0.038664 0.124612 -0.145449 0.131016 0.128464 0.374171 -0.417804 -0.173059 -0.198968 0.262904 -0.162212 0.125456 -0.147716 0.153764 0.078465 0.220715 -0.216687 -0.182385 0.125780 0.158557
qa: 0.1221 -0.1330 -0.0463 0.5418 -0.1654 -0.0924 -0.2116 0.1271 0.3013 -0.3188 -0.1730 -0.1680 -0.1742 0.1318 0.1457 -0.0655 -0.1402 0.3838 -0.3434 0.0387 0.1246 -0.1454 0.1310 0.1285 0.3742 -0.4178 -0.1731 -0.1990 0.2629 -0.1622 0.1255 -0.1477 0.1538 0.0785 0.2207 -0.2167 -0.1824 0.1258 0.1586
va: 1.0343 4.0614 3.8149 4.4349 4.0564 3.9494 4.0899 1.0159 3.7533 2.0943 1.1303 1.1274 1.1310 0.9996 1.0236 3.9724 3.7738 3.9088 3.0320 4.0389 0.9971 3.8940 1.0040 1.0147 4.1091 2.0886 3.2449 1.0896 3.9739 3.9262 1.0066 3.9338 1.0344 3.8725 3.9038 1.0687 3.9143 1.0109 1.0692
dispcorr: -0.017692994 hartree
energy: -1490.025643355512
dipole: 11.01835 -11.14597 -0.12762 10.32836 -10.23425 0.09411 -6.03887 5.33228 -0.70659
magnitude: 0.72417 au
magnitude: 1.84068 debye
