program: Orca
programVersion: 5.0.2
elementType: H C C C C F C C H C O F F F C C C H H H H H C H O N H C C H C C H C H C H H C H H H
charge: 0
multiplicity: 1
keywords: wb97x-d3
keywords: def2-TZVPP
keywords: def2/J RIJCOSX
keywords: DEFGRID2
keywords: scfconv7
keywords: smallprint printgap noloewdin
keywords: NOSOSCF
formula: C18H17F4NO2
InChI: InChI=1/C18H17F4NO2/c1-2-16(17(24)23-11-12-6-4-3-5-7-12)25-13-8-9-15(19)14(10-13)18(20,21)22/h3-10,16,23H,2,11H2,1H3
42 atoms
H  -0.241716 -0.091716 0.883755
C  0.102295 -1.11059 0.7802
C  1.469437 -1.364974 0.833091
C  2.446578 -0.248723 1.031217
C  1.922834 -2.665065 0.702783
F  3.239524 -2.914899 0.739111
C  1.045776 -3.71601 0.53278
C  -0.311091 -3.461253 0.484347
H  -1.006772 -4.279092 0.349795
C  -0.791513 -2.15869 0.601407
O  -2.134774 -2.016743 0.544099
F  1.840066 0.928671 1.189248
F  3.278307 -0.121886 -0.01074
F  3.207569 -0.442844 2.11564
C  -2.708198 -0.727435 0.518239
C  -4.216353 -0.900615 0.652283
C  -4.622236 -1.515445 1.982143
H  -4.587235 -1.50038 -0.182709
H  -4.675324 0.084856 0.556776
H  -5.708022 -1.576347 2.053952
H  -4.270306 -0.908806 2.818146
H  -4.230318 -2.523928 2.109756
C  -2.35404 -0.031327 -0.799567
H  -2.350161 -0.126791 1.364847
O  -2.008754 -0.675103 -1.783377
N  -2.492019 1.297245 -0.772974
H  0.542776 5.752992 -0.580242
C  0.49782 4.737102 -0.950859
C  -0.734653 4.140134 -1.184364
H  -1.646103 4.694415 -0.993334
C  -0.812367 2.836991 -1.66404
C  0.366885 2.134272 -1.905296
H  0.321308 1.118332 -2.279804
C  1.599071 2.727668 -1.671947
H  2.50868 2.174626 -1.86705
C  1.667226 4.031206 -1.19433
H  2.628774 4.494651 -1.015382
H  1.420844 -4.726004 0.435959
C  -2.152834 2.182008 -1.871208
H  -2.713448 1.733918 0.110457
H  -2.930988 2.940738 -1.953571
H  -2.167809 1.609459 -2.79652
elementType: H C F O N
totalener: -1300.91965606 hartree
nucrepener: 2308.65864140 hartree
electener: -3609.57829746 hartree
oneelecener: -6373.97579209 hartree
twoeener: 2764.39749463 hartree
cpcmener: -0.04464573 hartree
kineticenergy: 1295.79409537 hartree
xcener: -118.326757377333 hartree
chargesum: -0.0000000
charge: 0.127804 -0.113323 -0.122341 0.551838 0.214793 -0.215143 -0.162916 -0.226858 0.147080 0.272008 -0.329651 -0.178432 -0.182939 -0.178681 0.150112 -0.104538 -0.279975 0.086225 0.082586 0.095312 0.083317 0.084741 0.295549 0.122356 -0.547791 -0.163816 0.160826 -0.151641 -0.194086 0.144232 0.019599 -0.185580 0.143121 -0.179372 0.157097 -0.163277 0.160967 0.154913 0.017503 0.178441 0.116548 0.113392
qa: 0.1278 -0.1133 -0.1223 0.5518 0.2148 -0.2151 -0.1629 -0.2269 0.1471 0.2720 -0.3297 -0.1784 -0.1829 -0.1787 0.1501 -0.1045 -0.2800 0.0862 0.0826 0.0953 0.0833 0.0847 0.2955 0.1224 -0.5478 -0.1638 0.1608 -0.1516 -0.1941 0.1442 0.0196 -0.1856 0.1431 -0.1794 0.1571 -0.1633 0.1610 0.1549 0.0175 0.1784 0.1165 0.1134
va: 1.0426 3.8047 3.6385 4.4012 4.0468 1.0767 3.9086 4.0080 1.0081 3.8350 2.0768 1.1211 1.1115 1.1202 3.7659 3.8665 3.9411 1.0171 1.0193 1.0040 1.0009 1.0106 4.0939 0.9979 1.9481 3.2351 0.9889 3.8866 3.9521 1.0026 3.5952 3.8659 1.0194 3.8697 0.9980 3.8943 0.9888 0.9948 3.8043 1.0047 1.0031 1.0229
dispcorr: -0.021332509 hartree
energy: -1300.940988568958
dipole: -38.03072 35.69774 -2.33299 10.85007 -9.32602 1.52405 -4.94173 6.22915 1.28742
magnitude: 3.06969 au
magnitude: 7.80254 debye
