program: Gaussian 09
title: 000006521
version: EM64L-G09RevD.01
frameworkgroup: C1[X(C12H22O5)]
method: RPBEPBE
basis: SDD
operation: Freq
keyword: #pfreq=noraman
keyword: PBEPBE/SDD
title: #p freq=noraman PBEPBE/SDD
converged: NO YES NO NO
title: Mulliken charges:
elementType: O O O O O C C C C C C C C C C C C H H H H H H H H H H H H H H H H H H H H H H
charge: -0.212554 -0.210628 -0.216038 -0.466172 -0.377529 0.373558 0.286160 -0.495145 -0.471432 -0.458982 -0.471615 -0.385173 -0.389089 -0.373971 -0.386398 -0.393738 -0.394635 0.263787 0.218167 0.208968 0.247575 0.233837 0.204738 0.211272 0.232306 0.229543 0.202628 0.199454 0.225726 0.191611 0.210634 0.227146 0.194611 0.187610 0.208799 0.201633 0.185972 0.383766 0.373602
chargesum: 0.00000
title: Mulliken charges with hydrogens summed into heavy atoms:
elementType: O O O O O C C C C C C C C C C C C
charge: -0.212554 -0.210628 -0.216038 -0.082406 -0.003928 0.373558 0.286160 -0.013191 -0.014890 -0.020407 -0.028037 0.046997 0.036091 0.028273 0.035359 0.002671 -0.007030
polarizability: 1.86623946e+02 1.58929637e+00 1.41152282e+02 -2.97391156e+00 3.71150160e+00 1.29115683e+02
1716.lowfreq: -26.6728 -0.0008 -0.0005 0.0004 2.5970 10.0018 35.7987 59.8502 62.9177
frequency: 33.4067 59.4688 62.8344 95.4213 135.0585 153.4416 161.7515 179.1684 203.2393 214.6984 219.6902 253.0899 301.1982 304.1005 328.4221 336.6546 352.3846 367.1685 396.0035 421.8461 438.5074 446.8768 486.0284 489.6258 496.6857 541.7851 588.0476 597.2961 670.3427 716.1305 733.9916 773.5701 780.9620 784.7990 802.3781 807.4991 828.1625 835.0411 839.3811 867.2019 879.2963 909.6975 913.5749 920.3260 931.9270 935.0871 962.7173 1008.0120 1014.4413 1043.5013 1047.5294 1070.5469 1080.3346 1094.0278 1096.8935 1137.9797 1141.9706 1145.7438 1159.5465 1199.1477 1201.3163 1248.9603 1249.8315 1253.1621 1256.8619 1267.5238 1273.9846 1287.7450 1313.4575 1314.9787 1328.5734 1333.3307 1333.7809 1337.2700 1342.9323 1343.7431 1350.0769 1352.8195 1399.2002 1450.9675 1451.6963 1458.2552 1459.7187 1460.6120 1461.4873 1467.7888 1469.2125 1476.0954 1477.0432 2963.1176 2966.8835 2985.7369 2991.6992 2993.8866 2995.7656 2998.2110 3003.1660 3008.0992 3013.1926 3029.7689 3035.7074 3045.0801 3053.2707 3055.4766 3060.5328 3069.5538 3080.0604 3080.1511 3095.0161 3332.5174 3517.4579
redmass: 4.0449 3.6928 4.0162 3.3981 3.7663 6.3531 3.4612 3.8491 3.2429 2.8520 2.8982 2.7548 1.3905 2.2830 2.3254 2.5655 3.9244 2.7408 2.6018 2.6203 3.4344 3.1305 2.5077 2.7559 2.2287 4.1371 3.4458 4.1711 1.1353 3.6755 4.0478 1.9490 1.5536 3.2730 8.3563 2.5658 2.4706 3.1249 2.6202 1.8212 1.9756 2.8240 2.1959 2.1060 1.4736 1.5408 2.6100 2.5869 3.0458 1.8974 1.8675 1.3138 1.2752 1.5123 1.5725 1.7167 1.7861 2.0033 2.3320 1.4877 1.3915 1.3500 1.3180 1.3397 1.3114 1.3688 1.4292 1.6075 1.4904 1.3991 1.3681 1.3901 1.3817 1.3957 1.4179 1.4399 1.4778 1.4331 1.5886 1.0837 1.0859 1.0877 1.0891 1.0954 1.0848 1.0820 1.0825 1.0900 1.0967 1.0627 1.0636 1.0610 1.0611 1.0620 1.0605 1.0632 1.0642 1.0620 1.0644 1.0958 1.0959 1.1010 1.1011 1.1013 1.1012 1.1013 1.1005 1.1026 1.0997 1.0675 1.0673
irintensity: 1.4258 0.9121 2.7586 0.7491 3.5417 4.6895 2.0350 0.4026 3.5419 4.3648 0.3059 2.9036 88.3710 1.5860 1.8824 14.8247 14.5230 9.4338 3.6163 0.9372 0.2519 2.0213 1.1325 9.4073 8.2898 5.9402 33.8695 0.6645 165.3809 4.6043 9.0399 12.8527 0.7817 3.4528 13.5892 26.3048 28.3084 25.3740 8.7581 27.5013 19.3852 18.0161 25.3335 3.1729 0.4788 3.3125 39.1991 70.7046 33.5775 2.3292 6.3949 9.0242 4.0117 2.6816 0.5953 6.8844 9.8808 22.3442 31.2454 9.5628 45.6784 18.0852 12.5650 9.8383 24.5454 28.4324 12.1470 27.0775 3.6746 3.8354 12.5129 15.8288 4.4898 2.5760 0.3219 1.3253 8.5347 2.5304 18.3872 16.9782 0.9581 6.9904 10.8906 6.7018 10.1909 20.2398 18.1946 5.1150 2.2506 41.3890 41.6275 35.6280 40.3578 24.6451 35.8481 20.5531 14.0207 21.6534 16.9865 71.0102 54.4853 38.6236 26.6091 39.4742 54.2155 26.4038 13.4695 50.0111 12.4408 281.7565 35.4639
temp: 298.150 k
press: 1.00000 atm
elementType: 8 8 8 8 8 6 6 6 6 6 6 6 6 6 6 6 6 1 1 1 1 1 1 1 1 1 1 1 1 1 1 1 1 1 1 1 1 1 1
symmnumber: 1
zpe: 870836.2 jmol-1
zpe.correction: 0.331684 hartree
zpe.thermalcorrener: 0.349004 hartree
zpe.thermalcorrenthalpy: 0.349948 hartree
zpe.thermalcorrgfe: 0.287605 hartree
zpe.sumelectzpe: -845.078266 hartree
zpe.sumelectthermal: -845.060946 hartree
zpe.sumelectthermalent: -845.060002 hartree
zpe.sumelectthermalfe: -845.122345 hartree
dipole: -2.2485 0.7678 0.6997
dipole: 2.4768
quadrupole: -94.1112 -93.9940 -103.9031
quadrupole: -4.0204 2.1048 0.4796
quadrupole: 3.2249 3.3421 -6.5670 -4.0204 2.1048 0.4796
hfenergy: -845.4099499 hartree
pointgroup: C01[X(C12H22O5)]
dipole: -0.9107984 0.0032748 0.3464213 debye
polarizability: 185.6690356|7.5319927|134.6594178|0.7318359|7.1886531|136.5634563 unknown
InChI: InChI=1S/C12H22O5/c13-11(7-3-1-4-8-11)16-17-12(15-14)9-5-2-6-10-12/h13-14H,1-10H2
charge 0 multiplicity 1
39 atoms
O  -0.641743 -0.60591 0.323663
O  0.430581 -0.485693 -0.787317
O  -1.512712 1.641007 0.037003
O  1.568167 1.402615 0.233058
O  -0.919579 1.955023 1.439623
C  -1.811925 0.197423 -0.00417
C  1.685737 0.016543 -0.132818
C  -2.311538 0.016496 -1.454785
C  -2.846616 -0.231534 1.061789
C  2.06911 -0.878439 1.066303
C  2.708266 -0.072974 -1.284063
C  -2.79904 -1.437835 -1.6690
C  -3.367511 -1.666271 0.806614
C  3.490659 -0.530118 1.568642
C  4.126452 0.27287 -0.766091
C  -3.885333 -1.834019 -0.641796
C  4.529548 -0.627678 0.425691
H  -1.488306 0.264612 -2.144057
H  -3.141384 0.726676 -1.628669
H  -3.678417 0.496444 1.001998
H  -2.393398 -0.141235 2.063709
H  1.322222 -0.753484 1.870052
H  2.030021 -1.934914 0.737686
H  2.689558 -1.100466 -1.692755
H  2.398486 0.62603 -2.080232
H  -1.934103 -2.121993 -1.579234
H  -3.187935 -1.532748 -2.700417
H  -4.170593 -1.894753 1.533045
H  -2.545922 -2.384221 0.988208
H  3.765248 -1.206657 2.400785
H  3.487055 0.502415 1.96925
H  4.135708 1.332464 -0.448355
H  4.851766 0.166866 -1.595548
H  -4.782188 -1.196839 -0.790126
H  -4.202224 -2.880826 -0.810306
H  5.532369 -0.339446 0.795979
H  4.601579 -1.681704 0.084001
H  0.77891 1.542203 0.83598
H  -1.165674 2.92077 1.475359
