program: Orca
programVersion: 5.0.2
elementType: H C C C C F C C H C O F F F C C C H H H H H C H O N H C C H C C H C H C H H C H H H
charge: 0
multiplicity: 1
keywords: wb97x-d3
keywords: def2-TZVPP
keywords: def2/J RIJCOSX
keywords: DEFGRID2
keywords: scfconv7
keywords: smallprint printgap noloewdin
keywords: NOSOSCF
formula: C18H17F4NO2
InChI: InChI=1/C18H17F4NO2/c1-2-16(17(24)23-11-12-6-4-3-5-7-12)25-13-8-9-15(19)14(10-13)18(20,21)22/h3-10,16,23H,2,11H2,1H3
42 atoms
H  -0.332394 -1.028509 1.298941
C  0.120698 -1.27962 0.350966
C  1.505371 -1.196318 0.223996
C  2.357068 -0.730827 1.366824
C  2.092113 -1.524243 -0.984413
F  3.422473 -1.442715 -1.11731
C  1.336404 -1.930445 -2.065633
C  -0.036746 -1.999539 -1.940503
H  -0.640114 -2.306475 -2.784961
C  -0.653014 -1.666927 -0.736297
O  -2.006326 -1.738099 -0.730965
F  1.626629 -0.404296 2.435076
F  3.0782 0.350461 1.043324
F  3.229255 -1.666413 1.762216
C  -2.730531 -1.241566 0.380208
C  -4.200309 -1.57375 0.153298
C  -4.475119 -3.067814 0.078996
H  -4.549936 -1.079378 -0.756241
H  -4.762858 -1.138347 0.981865
H  -4.132088 -3.581442 0.978137
H  -3.991931 -3.532723 -0.779948
H  -5.545894 -3.247426 -0.015328
C  -2.553044 0.268886 0.554159
H  -2.395186 -1.722214 1.306103
O  -2.512859 0.759896 1.67698
N  -2.5145 0.986496 -0.573346
H  2.26602 1.68962 -1.445242
C  1.505062 2.367863 -1.080914
C  0.178917 1.955182 -1.05448
H  -0.068134 0.962062 -1.406302
C  -0.818779 2.805544 -0.589086
C  -0.463475 4.081784 -0.15945
H  -1.22939 4.757699 0.203249
C  0.859039 4.500038 -0.194741
H  1.116799 5.495922 0.141395
C  1.850696 3.641456 -0.652831
H  2.884221 3.962529 -0.672775
H  1.818208 -2.184973 -3.000304
C  -2.277308 2.410473 -0.596349
H  -2.517815 0.50007 -1.457363
H  -2.794389 2.875971 0.242996
H  -2.750114 2.803907 -1.497525
elementType: H C F O N
totalener: -1300.91956941 hartree
nucrepener: 2357.76317645 hartree
electener: -3658.68274586 hartree
oneelecener: -6471.51192760 hartree
twoeener: 2812.82918174 hartree
cpcmener: -0.03975846 hartree
kineticenergy: 1295.77583306 hartree
xcener: -118.326844281404 hartree
chargesum: -0.0000000
charge: 0.125302 -0.089851 -0.153381 0.539284 0.229531 -0.216151 -0.147519 -0.209532 0.146397 0.257137 -0.341944 -0.177481 -0.176199 -0.178759 0.168195 -0.113337 -0.279392 0.086049 0.087495 0.084266 0.083302 0.095456 0.285612 0.117158 -0.549698 -0.175093 0.160130 -0.190017 -0.176643 0.169289 0.037062 -0.197770 0.141926 -0.152818 0.159242 -0.165858 0.159566 0.154401 -0.013520 0.186851 0.108801 0.122510
qa: 0.1253 -0.0899 -0.1534 0.5393 0.2295 -0.2162 -0.1475 -0.2095 0.1464 0.2571 -0.3419 -0.1775 -0.1762 -0.1788 0.1682 -0.1133 -0.2794 0.0860 0.0875 0.0843 0.0833 0.0955 0.2856 0.1172 -0.5497 -0.1751 0.1601 -0.1900 -0.1766 0.1693 0.0371 -0.1978 0.1419 -0.1528 0.1592 -0.1659 0.1596 0.1544 -0.0135 0.1869 0.1088 0.1225
va: 1.0526 3.7499 3.6275 4.4264 4.0033 1.0722 3.9003 3.9873 1.0072 3.8059 2.0506 1.1252 1.1140 1.1196 3.7382 3.8867 3.9479 1.0143 1.0160 1.0006 1.0094 1.0041 4.0979 1.0113 1.9521 3.2175 0.9913 3.8800 3.8652 0.9772 3.6283 3.9571 1.0008 3.8843 0.9891 3.9030 0.9905 0.9947 3.8198 1.0059 1.0187 0.9938
dispcorr: -0.023708605 hartree
energy: -1300.943278020119
dipole: -36.64017 34.81976 -1.82041 5.56015 -6.10735 -0.54720 -11.70488 9.03733 -2.66755
magnitude: 3.27554 au
magnitude: 8.32577 debye
