program: Orca
programVersion: 5.0.2
elementType: H C C C C F C C H C O F F F C C C H H H H H C H O N H C C H C C H C H C H H C H H H
charge: 0
multiplicity: 1
keywords: wb97x-d3
keywords: def2-TZVPP
keywords: def2/J RIJCOSX
keywords: DEFGRID2
keywords: scfconv7
keywords: smallprint printgap noloewdin
keywords: NOSOSCF
formula: C18H17F4NO2
InChI: InChI=1/C18H17F4NO2/c1-2-16(17(24)23-11-12-6-4-3-5-7-12)25-13-8-9-15(19)14(10-13)18(20,21)22/h3-10,16,23H,2,11H2,1H3
42 atoms
H  -0.257483 -0.957492 1.402123
C  0.164699 -1.165056 0.430152
C  1.539863 -1.030964 0.25816
C  2.416016 -0.663532 1.417318
C  2.093209 -1.305622 -0.979102
F  3.416073 -1.192731 -1.155316
C  1.309924 -1.701266 -2.044161
C  -0.053018 -1.840421 -1.86798
H  -0.671648 -2.155828 -2.697997
C  -0.632819 -1.582154 -0.628282
O  -1.973547 -1.780236 -0.542224
F  3.244348 0.349416 1.140115
F  3.187733 -1.695653 1.790369
F  1.70421 -0.302963 2.488184
C  -2.662246 -1.320584 0.608764
C  -4.077158 -1.886625 0.579744
C  -4.920849 -1.515872 -0.629272
H  -4.570746 -1.555824 1.49584
H  -3.991912 -2.972658 0.65829
H  -5.151946 -0.451542 -0.659496
H  -5.870051 -2.050258 -0.590773
H  -4.438531 -1.784925 -1.569078
C  -2.632864 0.205337 0.695737
H  -2.184123 -1.696215 1.518921
O  -2.622631 0.75414 1.792889
N  -2.638995 0.861661 -0.469374
H  1.764244 1.803767 -2.872204
C  1.268925 2.094526 -1.954649
C  -0.113428 2.025305 -1.864316
H  -0.690347 1.679493 -2.714797
C  -0.767761 2.399924 -0.692312
C  -0.012517 2.836909 0.390784
H  -0.50931 3.128143 1.30856
C  1.372745 2.908099 0.302278
H  1.947704 3.257579 1.150109
C  2.016124 2.538207 -0.870323
H  3.094199 2.59889 -0.943346
H  1.764393 -1.903503 -3.004942
C  -2.264659 2.259397 -0.594219
H  -2.592501 0.316441 -1.318133
H  -2.657798 2.818888 0.252628
H  -2.747208 2.652121 -1.488725
elementType: H C F O N
totalener: -1300.91780122 hartree
nucrepener: 2414.36206226 hartree
electener: -3715.27986348 hartree
oneelecener: -6585.06848206 hartree
twoeener: 2869.78861858 hartree
cpcmener: -0.03711998 hartree
kineticenergy: 1295.78731550 hartree
xcener: -118.328171207348 hartree
chargesum: 0.0000000
charge: 0.124546 -0.109441 -0.132480 0.551354 0.232282 -0.215557 -0.161606 -0.207854 0.147364 0.254552 -0.343762 -0.174638 -0.179891 -0.181552 0.179546 -0.098008 -0.285687 0.081020 0.087424 0.082059 0.102052 0.089246 0.246983 0.120255 -0.545872 -0.154546 0.158324 -0.150010 -0.221432 0.145489 0.032692 -0.170728 0.141298 -0.165643 0.157030 -0.163746 0.155400 0.152793 -0.001777 0.188781 0.107904 0.125837
qa: 0.1245 -0.1094 -0.1325 0.5514 0.2323 -0.2156 -0.1616 -0.2079 0.1474 0.2546 -0.3438 -0.1746 -0.1799 -0.1816 0.1795 -0.0980 -0.2857 0.0810 0.0874 0.0821 0.1021 0.0892 0.2470 0.1203 -0.5459 -0.1545 0.1583 -0.1500 -0.2214 0.1455 0.0327 -0.1707 0.1413 -0.1656 0.1570 -0.1637 0.1554 0.1528 -0.0018 0.1888 0.1079 0.1258
va: 1.0531 3.7781 3.5910 4.4071 3.9992 1.0736 3.8821 3.9626 1.0055 3.8296 2.0649 1.1184 1.1176 1.1199 3.7477 3.8954 3.9317 1.0144 1.0103 1.0093 1.0039 1.0094 4.1558 1.0112 1.9614 3.1932 0.9905 3.8322 3.8926 1.0053 3.5220 3.8973 1.0113 3.8616 0.9920 3.8175 0.9937 0.9960 3.8328 1.0045 1.0186 1.0013
dispcorr: -0.026218439 hartree
energy: -1300.944019654581
dipole: -37.15944 35.66093 -1.49851 5.75085 -6.42896 -0.67810 -13.20808 10.65088 -2.55720
magnitude: 3.04049 au
magnitude: 7.72832 debye
