program: Orca
programVersion: 5.0.2
elementType: H C C C C F C C H C O F F F C C C H H H H H C H O N H C C H C C H C H C H H C H H H
charge: 0
multiplicity: 1
keywords: wb97x-d3
keywords: def2-TZVPP
keywords: def2/J RIJCOSX
keywords: DEFGRID2
keywords: scfconv7
keywords: smallprint printgap noloewdin
keywords: NOSOSCF
formula: C18H17F4NO2
InChI: InChI=1/C18H17F4NO2/c1-2-16(17(24)23-11-12-6-4-3-5-7-12)25-13-8-9-15(19)14(10-13)18(20,21)22/h3-10,16,23H,2,11H2,1H3
42 atoms
H  0.430463 -2.477967 -0.984444
C  0.542805 -1.779129 -0.166392
C  1.781613 -1.233922 0.139438
C  3.004328 -1.584279 -0.650709
C  1.872052 -0.326541 1.184525
F  3.057288 0.227586 1.471636
C  0.771072 0.024738 1.931325
C  -0.460244 -0.537213 1.633692
H  -1.310085 -0.266661 2.245293
C  -0.577765 -1.438522 0.581723
O  -1.748595 -2.04407 0.238142
F  3.981861 -2.062986 0.12826
F  3.506771 -0.51885 -1.289342
F  2.759697 -2.512063 -1.576782
C  -2.949074 -1.280937 0.325208
C  -4.07704 -2.156778 -0.189428
C  -5.432123 -1.475907 -0.079708
H  -4.081991 -3.077134 0.398279
H  -3.877111 -2.438625 -1.225329
H  -5.639926 -1.163707 0.944513
H  -6.224413 -2.15932 -0.382314
H  -5.504673 -0.595317 -0.719258
C  -2.762634 -0.033877 -0.541152
H  -3.161628 -1.01147 1.365987
O  -2.478069 -0.15293 -1.728323
N  -2.912249 1.13872 0.080472
H  2.011597 1.970566 -1.540019
C  1.266829 2.386586 -0.874109
C  -0.079739 2.163706 -1.124457
H  -0.371597 1.582071 -1.98925
C  -1.054955 2.689094 -0.278027
C  -0.653334 3.441152 0.822089
H  -1.401307 3.857609 1.486747
C  0.69395 3.670595 1.071195
H  0.989064 4.264032 1.926871
C  1.658015 3.142669 0.223766
H  2.70796 3.323213 0.413781
H  0.869076 0.731525 2.744259
C  -2.518422 2.406882 -0.509017
H  -3.020657 1.1264 1.08441
H  -3.129039 3.186495 -0.056162
H  -2.754627 2.392166 -1.571431
elementType: H C F O N
totalener: -1300.91786378 hartree
nucrepener: 2370.30139653 hartree
electener: -3671.21926031 hartree
oneelecener: -6497.31935625 hartree
twoeener: 2826.10009594 hartree
cpcmener: -0.04565823 hartree
kineticenergy: 1295.79402560 hartree
xcener: -118.326623300179 hartree
chargesum: -0.0000000
charge: 0.139587 -0.198423 -0.085897 0.535344 0.262916 -0.215335 -0.214755 -0.183860 0.160131 0.294002 -0.348992 -0.178350 -0.175682 -0.176212 0.161689 -0.101819 -0.291754 0.083814 0.074019 0.089397 0.097874 0.089408 0.254764 0.106231 -0.550731 -0.137199 0.155535 -0.147988 -0.199574 0.141550 0.016027 -0.170725 0.143497 -0.158792 0.158494 -0.168197 0.155907 0.156828 0.008261 0.183468 0.120465 0.115078
qa: 0.1396 -0.1984 -0.0859 0.5353 0.2629 -0.2153 -0.2148 -0.1839 0.1601 0.2940 -0.3490 -0.1783 -0.1757 -0.1762 0.1617 -0.1018 -0.2918 0.0838 0.0740 0.0894 0.0979 0.0894 0.2548 0.1062 -0.5507 -0.1372 0.1555 -0.1480 -0.1996 0.1416 0.0160 -0.1707 0.1435 -0.1588 0.1585 -0.1682 0.1559 0.1568 0.0083 0.1835 0.1205 0.1151
va: 1.0280 4.0807 3.6045 4.4420 3.9629 1.0700 3.8643 3.8512 0.9958 3.7653 2.0591 1.1199 1.1164 1.1282 3.8349 3.8955 3.9531 1.0139 1.0287 1.0008 1.0033 1.0052 4.0903 1.0004 1.9558 3.2075 1.0019 3.8382 3.8624 1.0265 3.5317 3.9126 1.0019 3.8653 0.9900 3.8339 0.9931 0.9990 3.8230 1.0020 1.0034 1.0172
dispcorr: -0.025387668 hartree
energy: -1300.943251447979
dipole: -43.90432 41.40119 -2.50313 13.33823 -11.90332 1.43491 5.05672 -2.26992 2.78680
magnitude: 4.01134 au
magnitude: 10.19603 debye
