program: Orca
programVersion: 5.0.2
elementType: H C C C C F C C H C O F F F C C C H H H H H C H O N H C C H C C H C H C H H C H H H
charge: 0
multiplicity: 1
keywords: wb97x-d3
keywords: def2-TZVPP
keywords: def2/J RIJCOSX
keywords: DEFGRID2
keywords: scfconv7
keywords: smallprint printgap noloewdin
keywords: NOSOSCF
formula: C18H17F4NO2
InChI: InChI=1/C18H17F4NO2/c1-2-16(17(24)23-11-12-6-4-3-5-7-12)25-13-8-9-15(19)14(10-13)18(20,21)22/h3-10,16,23H,2,11H2,1H3
42 atoms
H  -0.390851 -0.804053 1.244298
C  0.058503 -1.050471 0.29374
C  1.444527 -0.96402 0.174014
C  2.25033 -0.575955 1.376578
C  2.038074 -1.308851 -1.025887
F  3.369431 -1.269954 -1.158632
C  1.279586 -1.704925 -2.110991
C  -0.092918 -1.7789 -1.991453
H  -0.692418 -2.089378 -2.837258
C  -0.71271 -1.460338 -0.784647
O  -2.062496 -1.58153 -0.759754
F  3.332735 0.144954 1.077562
F  2.674842 -1.659025 2.04452
F  1.530297 0.148582 2.238722
C  -2.773011 -1.1649 0.3956
C  -4.226365 -1.579643 0.22223
C  -4.407174 -3.088889 0.176563
H  -4.63644 -1.116601 -0.678492
H  -4.78326 -1.168317 1.066784
H  -4.002553 -3.561651 1.072639
H  -3.917557 -3.534935 -0.688689
H  -5.465146 -3.343292 0.118546
C  -2.644752 0.343846 0.607636
H  -2.372656 -1.655684 1.290183
O  -2.574151 0.808341 1.740059
N  -2.649298 1.086208 -0.506223
H  1.830894 1.801816 -2.795882
C  1.349043 2.107319 -1.876051
C  -0.034364 2.112396 -1.789676
H  -0.626784 1.810559 -2.646155
C  -0.671682 2.505243 -0.613239
C  0.102348 2.87884 0.479193
H  -0.380136 3.17672 1.402476
C  1.489987 2.879374 0.393293
H  2.081286 3.179009 1.248864
C  2.115827 2.495081 -0.783391
H  3.195692 2.498578 -0.851982
H  1.765752 -1.957621 -3.043885
C  -2.175639 2.458241 -0.528261
H  -2.634469 0.600016 -1.391409
H  -2.535244 2.981495 0.35546
H  -2.623374 2.948169 -1.391946
elementType: H C F O N
totalener: -1300.91871172 hartree
nucrepener: 2421.50668701 hartree
electener: -3722.42539874 hartree
oneelecener: -6599.47607755 hartree
twoeener: 2877.05067881 hartree
cpcmener: -0.03697100 hartree
kineticenergy: 1295.80751595 hartree
xcener: -118.331255893973 hartree
chargesum: 0.0000000
charge: 0.118065 -0.132372 -0.120950 0.552287 0.232838 -0.214634 -0.152030 -0.233707 0.146949 0.294544 -0.343238 -0.176155 -0.179640 -0.181115 0.169129 -0.111101 -0.277055 0.085208 0.087284 0.083597 0.083309 0.095241 0.275634 0.114603 -0.542258 -0.168588 0.156808 -0.157402 -0.216844 0.144456 0.032090 -0.171237 0.141172 -0.166109 0.156908 -0.155745 0.155838 0.152189 0.005185 0.182892 0.106570 0.127382
qa: 0.1181 -0.1324 -0.1209 0.5523 0.2328 -0.2146 -0.1520 -0.2337 0.1469 0.2945 -0.3432 -0.1762 -0.1796 -0.1811 0.1691 -0.1111 -0.2771 0.0852 0.0873 0.0836 0.0833 0.0952 0.2756 0.1146 -0.5423 -0.1686 0.1568 -0.1574 -0.2168 0.1445 0.0321 -0.1712 0.1412 -0.1661 0.1569 -0.1557 0.1558 0.1522 0.0052 0.1829 0.1066 0.1274
va: 1.0641 3.8072 3.5799 4.4150 4.0072 1.0747 3.8788 3.9912 1.0066 3.7827 2.0524 1.1200 1.1135 1.1145 3.7173 3.8922 3.9447 1.0147 1.0154 1.0008 1.0093 1.0045 4.1334 1.0121 1.9592 3.1997 0.9912 3.8403 3.8886 1.0058 3.5048 3.8907 1.0100 3.8517 0.9924 3.8022 0.9937 0.9961 3.8317 1.0143 1.0183 1.0006
dispcorr: -0.026321573 hartree
energy: -1300.945033298101
dipole: -34.83148 33.31464 -1.51684 2.56769 -3.09985 -0.53216 -11.57468 8.94121 -2.63347
magnitude: 3.08532 au
magnitude: 7.84225 debye
