program: Orca
programVersion: 5.0.2
elementType: H C C C C F C C H C O F F F C C C H H H H H C H O N H C C H C C H C H C H H C H H H
charge: 0
multiplicity: 1
keywords: wb97x-d3
keywords: def2-TZVPP
keywords: def2/J RIJCOSX
keywords: DEFGRID2
keywords: scfconv7
keywords: smallprint printgap noloewdin
keywords: NOSOSCF
formula: C18H17F4NO2
InChI: InChI=1/C18H17F4NO2/c1-2-16(17(24)23-11-12-6-4-3-5-7-12)25-13-8-9-15(19)14(10-13)18(20,21)22/h3-10,16,23H,2,11H2,1H3
42 atoms
H  0.399033 -2.11306 -1.173669
C  0.497221 -1.566673 -0.245237
C  1.735785 -1.128895 0.192709
C  2.978793 -1.421458 -0.588664
C  1.813611 -0.415296 1.381015
F  3.003231 0.032336 1.80528
C  0.692181 -0.152175 2.130047
C  -0.546618 -0.598701 1.694031
H  -1.408197 -0.380446 2.309363
C  -0.648527 -1.300997 0.499234
O  -1.810941 -1.760974 -0.027634
F  2.716524 -2.066556 -1.726669
F  3.826402 -2.18926 0.107957
F  3.644037 -0.306837 -0.916903
C  -3.038168 -1.310387 0.523051
C  -4.165906 -2.085843 -0.147962
C  -4.288793 -1.903758 -1.653018
H  -5.095389 -1.789344 0.341997
H  -4.021182 -3.141715 0.091317
H  -3.359436 -2.133511 -2.17497
H  -4.58571 -0.890555 -1.921642
H  -5.051679 -2.576432 -2.043659
C  -3.202339 0.205231 0.375024
H  -3.077287 -1.529092 1.595593
O  -3.85129 0.831735 1.205944
N  -2.621474 0.752767 -0.697733
H  2.089411 2.00948 -2.16021
C  1.379098 2.297417 -1.39621
C  0.022315 2.104007 -1.608019
H  -0.318974 1.663973 -2.538506
C  -0.908404 2.467969 -0.636568
C  -0.456429 3.038051 0.54871
H  -1.169501 3.322729 1.313253
C  0.901846 3.244322 0.758622
H  1.240877 3.693114 1.683394
C  1.822892 2.8682 -0.209194
H  2.880878 3.02541 -0.044595
H  0.776647 0.40354 3.053837
C  -2.370253 2.174108 -0.856442
H  -2.107254 0.144416 -1.318665
H  -2.990166 2.722763 -0.151022
H  -2.675294 2.477449 -1.8586
elementType: H C F O N
totalener: -1300.91740757 hartree
nucrepener: 2383.51221957 hartree
electener: -3684.42962714 hartree
oneelecener: -6522.66967491 hartree
twoeener: 2838.24004777 hartree
cpcmener: -0.03499809 hartree
kineticenergy: 1295.79676143 hartree
xcener: -118.330472767408 hartree
chargesum: 0.0000000
charge: 0.137865 -0.191520 -0.089428 0.541666 0.262415 -0.217255 -0.240515 -0.110468 0.140812 0.235131 -0.342041 -0.177587 -0.178263 -0.176551 0.176630 -0.099379 -0.287921 0.082003 0.086526 0.089472 0.083872 0.102470 0.235608 0.121659 -0.546649 -0.146988 0.155704 -0.165238 -0.209299 0.146527 0.024989 -0.185782 0.143074 -0.151824 0.158899 -0.151125 0.158806 0.156831 0.019199 0.186486 0.099252 0.121940
qa: 0.1379 -0.1915 -0.0894 0.5417 0.2624 -0.2173 -0.2405 -0.1105 0.1408 0.2351 -0.3420 -0.1776 -0.1783 -0.1766 0.1766 -0.0994 -0.2879 0.0820 0.0865 0.0895 0.0839 0.1025 0.2356 0.1217 -0.5466 -0.1470 0.1557 -0.1652 -0.2093 0.1465 0.0250 -0.1858 0.1431 -0.1518 0.1589 -0.1511 0.1588 0.1568 0.0192 0.1865 0.0993 0.1219
va: 1.0270 3.9923 3.5810 4.4312 3.9364 1.0638 3.9276 3.7771 1.0215 3.8487 2.0615 1.1268 1.1192 1.1174 3.7339 3.8955 3.9301 1.0151 1.0115 1.0096 1.0075 1.0044 4.1704 1.0101 1.9650 3.1934 0.9968 3.8335 3.8829 1.0024 3.5670 3.8764 1.0060 3.8329 0.9901 3.8142 0.9903 0.9996 3.8099 1.0034 1.0331 0.9991
dispcorr: -0.025727973 hartree
energy: -1300.943135545597
dipole: -39.07065 38.18776 -0.88288 9.04154 -9.34274 -0.30121 -3.97372 3.11118 -0.86254
magnitude: 1.27050 au
magnitude: 3.22936 debye
