program: Gaussian 09
title: 000057650
version: EM64L-G09RevD.01
frameworkgroup: C1[X(C20H15N3O)]
method: RPBEPBE
basis: SDD
operation: Freq
keyword: #p
keyword: freq=noraman
keyword: PBEPBE/SDD
title: #p freq=noraman PBEPBE/SDD
converged: YES YES NO NO
title: Mulliken charges:
elementType: O N N N C C C C C C C C C C C C C C C C C C C C H H H H H H H H H H H H H H H
charge: -0.249187 -0.491490 -0.001046 -0.007427 0.346209 0.277080 0.484965 -0.498469 -0.361627 -0.460537 0.135977 -0.810229 -0.273764 0.246718 -0.339811 -0.356236 -0.188078 -0.221729 -0.236525 -0.222807 -0.287488 0.283872 -0.246072 -0.255109 0.312506 0.235619 0.243205 0.313761 0.226703 0.244509 0.238907 0.199408 0.275077 0.220035 0.256373 0.237822 0.236199 0.238569 0.254118
chargesum: 0.00000
title: Mulliken charges with hydrogens summed into heavy atoms:
elementType: O N N N C C C C C C C C C C C C C C C C C C C C
charge: -0.249187 -0.177729 -0.001046 -0.007427 0.346209 0.277080 0.484965 -0.185963 -0.126008 -0.217332 0.135977 -0.100110 -0.074356 0.246718 -0.064735 -0.136201 0.068295 0.016092 -0.000327 0.015762 -0.033369 0.283872 -0.246072 -0.255109
polarizability: 4.60323859e+02 -7.22525193e+01 3.82461133e+02 2.25864172e+01 4.69011395e+00 1.15883744e+02
1716.lowfreq: -7.6446 -4.1738 -2.6308 -0.0009 -0.0007 0.0004 8.0267 21.2056 22.4597
frequency: -0.7439 21.1618 22.4399 28.3987 43.4657 46.0399 65.6532 76.8522 100.3681 116.0992 134.2267 152.7912 167.5247 192.3049 215.2121 232.2716 250.7664 278.4114 298.3699 310.3081 319.3627 377.4030 391.5244 402.8362 417.3600 450.5491 475.8220 483.0220 495.6199 508.4132 576.2238 581.8199 590.1349 600.5682 614.0748 643.9716 646.4105 673.4815 689.0807 705.0948 724.4543 740.4953 764.3688 792.7361 819.1580 842.6474 854.7083 866.2457 883.8094 920.2257 926.3187 933.9651 946.5434 966.5163 984.2155 985.1524 989.6570 1007.7706 1014.7723 1024.3830 1046.9716 1068.8993 1088.8610 1120.7772 1147.0533 1176.1257 1186.1973 1193.9957 1201.9176 1234.9684 1249.2466 1277.6981 1287.3303 1305.7718 1313.2738 1320.3016 1340.0969 1375.8129 1385.1754 1397.3395 1427.1522 1433.3589 1457.0504 1466.9120 1473.7989 1481.1596 1510.3249 1550.1402 1568.3882 1580.1223 1598.7991 1609.3197 1616.1143 1625.5716 2158.3025 2169.5196 2980.3632 3060.6724 3063.1223 3093.3334 3112.8722 3116.4350 3129.2089 3136.0308 3137.4721 3148.4160 3160.5846 3161.0041 3172.6056 3184.0376 3548.1390
redmass: 1.0180 8.7869 5.0478 7.1916 5.4581 5.3797 5.2904 6.9200 5.0474 9.4241 6.8453 4.8175 4.3752 3.5506 4.6472 3.7654 5.1660 4.9809 4.3282 4.7505 5.7463 3.8687 4.6579 2.8499 4.6254 5.3357 4.8930 5.0959 4.3945 5.8926 3.9638 4.7067 12.3852 3.6676 6.3292 3.3854 1.7743 6.0001 4.5308 1.5489 5.5454 3.5267 6.0347 2.4046 1.3400 4.9101 1.2710 2.7583 2.5106 1.5989 1.3898 1.5447 2.3109 1.3690 1.1981 1.4823 3.8209 1.3464 1.6950 2.4926 1.5950 2.7816 1.6657 2.4497 3.2925 1.0588 1.8439 1.1559 1.5827 1.8185 3.1173 2.2366 1.9919 1.5823 1.8552 1.3901 1.8412 3.3164 8.7727 1.2302 3.4351 2.2949 2.5253 1.0898 1.1361 2.3169 2.3335 5.5682 5.5958 5.3439 4.5555 5.9491 5.0205 5.7488 12.6181 12.6340 1.0384 1.0955 1.0883 1.0997 1.0884 1.0924 1.0894 1.0867 1.0876 1.0916 1.0966 1.0956 1.1009 1.0928 1.0752
irintensity: 0.6547 1.0351 3.2006 1.4995 0.0704 3.3823 0.7788 3.2388 3.1824 2.8390 0.3532 2.1732 2.2732 2.3687 2.4079 3.3138 2.5297 9.9242 0.2203 3.3078 2.3032 1.4921 1.9679 0.1270 2.4174 3.2640 3.6070 0.8384 7.4148 14.0143 6.3751 2.8572 0.6967 6.9901 1.8977 8.3101 30.4902 20.4076 9.0147 113.0940 13.5404 8.3297 0.1362 13.5142 33.2148 7.0570 1.9005 14.0123 6.6571 1.7704 14.8648 0.6933 7.1344 0.6546 57.2315 19.5358 3.4735 1.9069 1.7570 16.9796 23.4374 29.0708 12.0961 12.0077 0.3402 2.3191 9.1228 30.3576 64.3774 70.1880 183.9135 33.9999 200.3149 41.7360 125.8726 34.4896 36.4729 125.9167 1.1875 28.4302 270.6449 8.9776 17.6754 39.8682 62.1746 4.6377 475.7880 163.4604 68.3920 96.1670 753.6271 8.6857 25.2821 24.1948 13.3836 128.1976 21.5561 16.4206 16.9591 18.5813 17.5507 1.0154 14.7713 0.6591 4.6023 16.5698 12.5755 11.1240 21.3983 5.8765 9.2866
temp: 298.150 k
press: 1.00000 atm
elementType: 8 7 7 7 6 6 6 6 6 6 6 6 6 6 6 6 6 6 6 6 6 6 6 6 1 1 1 1 1 1 1 1 1 1 1 1 1 1 1
symmnumber: 1
zpe: 771781.1 jmol-1
zpe.correction: 0.293956 hartree
zpe.thermalcorrener: 0.315288 hartree
zpe.thermalcorrenthalpy: 0.316232 hartree
zpe.thermalcorrgfe: 0.240286 hartree
zpe.sumelectzpe: -1008.935660 hartree
zpe.sumelectthermal: -1008.914328 hartree
zpe.sumelectthermalent: -1008.913384 hartree
zpe.sumelectthermalfe: -1008.989330 hartree
dipole: -6.6838 1.2111 0.2312
dipole: 6.7966
quadrupole: -190.9657 -127.8347 -143.3833
quadrupole: 27.5898 -1.5854 -4.0384
quadrupole: -36.9045 26.2265 10.6780 27.5898 -1.5854 -4.0384
hfenergy: -1009.229616 hartree
pointgroup: C01 [X(C20H15N3O1)]
dipole: 2.6067014 0.5748548 0.1575271 debye
polarizability: 500.8514391|-23.4368198|339.5106847|-1.2536711|-30.7483283|118.3066124 unknown
InChI: InChI=1S/C20H15N3O/c1-15-10-11-17(9-5-6-16(13-21)14-22)19(12-15)23-20(24)18-7-3-2-4-8-18/h2-12,23H,1H3
charge 0 multiplicity 1
39 atoms
O  3.888643 0.280157 -0.426235
N  1.566861 0.115459 -0.07266
N  -6.628176 1.262201 -1.150532
N  -5.752651 -2.781121 0.663331
C  1.371393 -1.287844 -0.013873
C  0.020445 -1.798792 -0.078406
C  2.251626 -3.566816 0.312425
C  2.460886 -2.176704 0.15991
C  -0.162561 -3.203087 0.102266
C  0.920937 -4.070159 0.295902
C  2.766514 0.832441 -0.220767
C  3.434809 -4.499238 0.479429
C  -1.113446 -0.930353 -0.369479
C  2.619015 2.32954 -0.140475
C  3.621527 3.114507 -0.766327
C  1.560781 2.978195 0.552017
C  -2.454466 -1.226834 -0.182816
C  3.552883 4.521785 -0.728132
C  1.496845 4.388059 0.594355
C  2.487258 5.162927 -0.052371
C  -3.493898 -0.315994 -0.566012
C  -4.862055 -0.541649 -0.40211
C  -5.826947 0.439771 -0.809665
C  -5.359841 -1.759076 0.178059
H  3.472931 -1.767806 0.173443
H  -1.17364 -3.618609 0.045519
H  0.745703 -5.144809 0.414808
H  0.72604 0.689409 -0.00289
H  3.118994 -5.503705 0.807801
H  3.981186 -4.613957 -0.476577
H  4.157823 -4.1050 1.215798
H  -0.900804 0.048735 -0.828703
H  4.4449 2.597874 -1.269909
H  0.809452 2.402542 1.108008
H  -2.754061 -2.174374 0.281913
H  4.327314 5.118937 -1.221071
H  0.685467 4.880398 1.140948
H  2.434823 6.256587 -0.020005
H  -3.200108 0.638302 -1.024417
