program: Orca
programVersion: 5.0.2
elementType: H C C C C F C C H C O F F F C C C H H H H H C H O N H C C H C C H C H C H H C H H H
charge: 0
multiplicity: 1
keywords: wb97x-d3
keywords: def2-TZVPP
keywords: def2/J RIJCOSX
keywords: DEFGRID2
keywords: scfconv7
keywords: smallprint printgap noloewdin
keywords: NOSOSCF
formula: C18H17F4NO2
InChI: InChI=1/C18H17F4NO2/c1-2-16(17(24)23-11-12-6-4-3-5-7-12)25-13-8-9-15(19)14(10-13)18(20,21)22/h3-10,16,23H,2,11H2,1H3
42 atoms
H  0.33618 -2.310597 -1.275134
C  0.477184 -1.689208 -0.400631
C  1.748386 -1.343201 0.026793
C  2.964951 -1.81823 -0.705597
C  1.881308 -0.531148 1.144973
F  3.102449 -0.163235 1.555121
C  0.781962 -0.087869 1.839682
C  -0.490043 -0.443529 1.415882
H  -1.330726 -0.083197 1.991468
C  -0.64694 -1.237647 0.285308
O  -1.838156 -1.621218 -0.230406
F  2.653064 -2.588683 -1.749911
F  3.772734 -2.539486 0.081203
F  3.689434 -0.795561 -1.176612
C  -3.031112 -1.062336 0.292344
C  -4.20035 -1.752413 -0.395475
C  -4.246164 -3.249644 -0.131531
H  -4.162312 -1.556725 -1.470447
H  -5.115438 -1.284319 -0.025805
H  -5.142736 -3.68446 -0.573833
H  -4.269487 -3.464912 0.938205
H  -3.388708 -3.768981 -0.55919
C  -3.080357 0.45283 0.079261
H  -3.099106 -1.240956 1.371889
O  -3.593335 1.18026 0.917639
N  -2.557274 0.889856 -1.074263
H  0.508432 4.130542 1.98466
C  0.446162 3.586726 1.050463
C  -0.796781 3.325773 0.485346
H  -1.696242 3.66613 0.984498
C  -0.894673 2.634079 -0.717258
C  0.273781 2.19888 -1.340592
H  0.212456 1.658287 -2.278766
C  1.514625 2.453745 -0.77685
H  2.413135 2.10959 -1.273408
C  1.603708 3.150878 0.422134
H  2.571959 3.353455 0.862003
H  0.909286 0.539132 2.711967
C  -2.236375 2.284962 -1.312054
H  -2.108177 0.218881 -1.679815
H  -3.023812 2.913518 -0.899415
H  -2.231936 2.443836 -2.390361
elementType: H C F O N
totalener: -1300.92946075 hartree
nucrepener: 2361.23298538 hartree
electener: -3662.16244613 hartree
oneelecener: -6478.20894959 hartree
twoeener: 2816.04650346 hartree
cpcmener: -0.02874299 hartree
kineticenergy: 1295.79435168 hartree
xcener: -118.326551683319 hartree
chargesum: 0.0000000
charge: 0.137500 -0.198916 -0.084544 0.536532 0.261105 -0.215038 -0.236494 -0.144872 0.135730 0.279531 -0.334689 -0.176977 -0.176770 -0.176099 0.165101 -0.111190 -0.276154 0.082192 0.086956 0.094397 0.082693 0.084474 0.251225 0.112776 -0.505125 -0.168557 0.154830 -0.156553 -0.165498 0.137812 0.036653 -0.223269 0.139543 -0.140263 0.152928 -0.163968 0.155082 0.154110 0.002954 0.177783 0.108136 0.124935
qa: 0.1375 -0.1989 -0.0845 0.5365 0.2611 -0.2150 -0.2365 -0.1449 0.1357 0.2795 -0.3347 -0.1770 -0.1768 -0.1761 0.1651 -0.1112 -0.2762 0.0822 0.0870 0.0944 0.0827 0.0845 0.2512 0.1128 -0.5051 -0.1686 0.1548 -0.1566 -0.1655 0.1378 0.0367 -0.2233 0.1395 -0.1403 0.1529 -0.1640 0.1551 0.1541 0.0030 0.1778 0.1081 0.1249
va: 1.0272 4.0266 3.6171 4.4398 3.9769 1.0706 3.9127 3.8079 1.0312 3.8162 2.0555 1.1271 1.1222 1.1179 3.7216 3.8943 3.9456 1.0149 1.0152 1.0045 1.0011 1.0094 4.1688 1.0120 2.0079 3.1816 0.9914 3.8846 3.9011 1.0146 3.5159 3.9025 1.0060 3.8363 0.9982 3.8439 0.9919 0.9996 3.8311 1.0166 1.0181 1.0010
dispcorr: -0.025023942 hartree
energy: -1300.954484688341
dipole: -39.33726 38.23662 -1.10064 9.88220 -10.09542 -0.21322 0.23416 -1.11096 -0.87680
magnitude: 1.42325 au
magnitude: 3.61762 debye
