program: Orca
programVersion: 5.0.2
elementType: H C C C C F C C H C O F F F C C C H H H H H C H O N H C C H C C H C H C H H C H H H
charge: 0
multiplicity: 1
keywords: wb97x-d3
keywords: def2-TZVPP
keywords: def2/J RIJCOSX
keywords: DEFGRID2
keywords: scfconv7
keywords: smallprint printgap noloewdin
keywords: NOSOSCF
formula: C18H17F4NO2
InChI: InChI=1/C18H17F4NO2/c1-2-16(17(24)23-11-12-6-4-3-5-7-12)25-13-8-9-15(19)14(10-13)18(20,21)22/h3-10,16,23H,2,11H2,1H3
42 atoms
H  1.197025 -1.899068 -1.225662
C  1.109792 -1.883216 -0.147306
C  2.183176 -2.225009 0.657539
C  3.509241 -2.591493 0.063873
C  2.023186 -2.189739 2.036961
F  3.052781 -2.5162 2.829908
C  0.829305 -1.818897 2.607609
C  -0.24314 -1.467495 1.799046
H  -1.165858 -1.175596 2.281247
C  -0.104742 -1.499472 0.416472
O  -1.073849 -1.169903 -0.467229
F  3.47001 -2.628303 -1.269375
F  3.930932 -3.792091 0.476656
F  4.45787 -1.708628 0.401158
C  -2.325844 -0.709285 0.004057
C  -3.288741 -0.704959 -1.178043
C  -3.52169 -2.086539 -1.767537
H  -2.918701 -0.018927 -1.945096
H  -4.236715 -0.294995 -0.823894
H  -3.895628 -2.781741 -1.013649
H  -2.614559 -2.511438 -2.196611
H  -4.265028 -2.03517 -2.563467
C  -2.253972 0.697538 0.599287
H  -2.719667 -1.377529 0.778657
O  -3.109907 1.056839 1.396486
N  -1.262593 1.474874 0.15038
H  -4.081434 4.616743 -2.612847
C  -3.077913 4.631266 -2.206885
C  -2.746306 3.786319 -1.159196
H  -3.49886 3.121276 -0.751113
C  -1.459559 3.794434 -0.622677
C  -0.515856 4.665504 -1.154209
H  0.48931 4.678855 -0.748863
C  -0.846739 5.516198 -2.2024
H  -0.099715 6.187566 -2.606523
C  -2.127386 5.498792 -2.733088
H  -2.386966 6.157987 -3.551481
H  0.728328 -1.795902 3.684617
C  -1.095807 2.86678 0.508688
H  -0.63845 1.109508 -0.553835
H  -0.058574 3.031573 0.805385
H  -1.71175 3.069649 1.384035
elementType: H C F O N
totalener: -1300.93107881 hartree
nucrepener: 2191.84856833 hartree
electener: -3492.77964715 hartree
oneelecener: -6138.74614129 hartree
twoeener: 2645.96649414 hartree
cpcmener: -0.02868607 hartree
kineticenergy: 1295.78270959 hartree
xcener: -118.323234624256 hartree
chargesum: 0.0000000
charge: 0.140194 -0.203538 -0.093062 0.536043 0.259722 -0.211996 -0.227190 -0.129155 0.140512 0.261842 -0.337695 -0.176514 -0.176974 -0.177077 0.152703 -0.103996 -0.278115 0.081184 0.084510 0.083182 0.083812 0.095539 0.271193 0.115212 -0.522549 -0.158853 0.157006 -0.156787 -0.197395 0.148291 0.016694 -0.198619 0.141267 -0.142311 0.157258 -0.168124 0.157282 0.152494 0.023914 0.176465 0.109721 0.113907
qa: 0.1402 -0.2035 -0.0931 0.5360 0.2597 -0.2120 -0.2272 -0.1292 0.1405 0.2618 -0.3377 -0.1765 -0.1770 -0.1771 0.1527 -0.1040 -0.2781 0.0812 0.0845 0.0832 0.0838 0.0955 0.2712 0.1152 -0.5225 -0.1589 0.1570 -0.1568 -0.1974 0.1483 0.0167 -0.1986 0.1413 -0.1423 0.1573 -0.1681 0.1573 0.1525 0.0239 0.1765 0.1097 0.1139
va: 1.0267 4.0375 3.6395 4.4433 4.0277 1.0782 3.9683 3.8515 1.0179 3.8637 2.0504 1.1276 1.1226 1.1193 3.7679 3.8609 3.9508 1.0165 1.0218 1.0008 1.0095 1.0042 4.1478 1.0106 1.9902 3.1917 0.9921 3.9080 3.9130 1.0106 3.6556 3.9640 1.0039 3.8913 0.9907 3.9051 0.9905 0.9998 3.7909 1.0151 1.0042 1.0245
dispcorr: -0.019536324 hartree
energy: -1300.950615137903
dipole: -43.75504 43.07612 -0.67892 26.61452 -25.99098 0.62354 -13.10560 12.15471 -0.95089
magnitude: 1.32436 au
magnitude: 3.36626 debye
