program: Orca
programVersion: 5.0.2
elementType: H C C C C F C C H C O F F F C C C H H H H H C H O N H C C H C C H C H C H H C H H H
charge: 0
multiplicity: 1
keywords: wb97x-d3
keywords: def2-TZVPP
keywords: def2/J RIJCOSX
keywords: DEFGRID2
keywords: scfconv7
keywords: smallprint printgap noloewdin
keywords: NOSOSCF
formula: C18H17F4NO2
InChI: InChI=1/C18H17F4NO2/c1-2-16(17(24)23-11-12-6-4-3-5-7-12)25-13-8-9-15(19)14(10-13)18(20,21)22/h3-10,16,23H,2,11H2,1H3
42 atoms
H  1.184012 -2.086087 -1.255015
C  1.19419 -1.988222 -0.17744
C  2.30587 -2.359685 0.559315
C  3.526351 -2.914408 -0.107714
C  2.272498 -2.221128 1.940809
F  3.341801 -2.577776 2.665618
C  1.16329 -1.722458 2.580455
C  0.050269 -1.347529 1.840164
H  -0.804896 -0.958373 2.375019
C  0.063385 -1.479635 0.456648
O  -0.957177 -1.142401 -0.363663
F  3.782174 -4.165229 0.294572
F  4.616595 -2.186534 0.162668
F  3.401775 -2.949425 -1.435965
C  -2.191476 -0.722703 0.187757
C  -3.254912 -0.852497 -0.899667
C  -3.048578 0.032007 -2.120383
H  -4.219481 -0.631463 -0.438828
H  -3.294684 -1.90282 -1.197636
H  -3.123454 1.093407 -1.879505
H  -3.816216 -0.180456 -2.864779
H  -2.082966 -0.13773 -2.597889
C  -2.151921 0.707965 0.72058
H  -2.478432 -1.373004 1.021678
O  -3.020222 1.075802 1.501047
N  -1.166214 1.488832 0.266666
H  -0.806679 5.642897 -3.189605
C  -1.443751 5.149626 -2.466391
C  -0.876432 4.400609 -1.442932
H  0.202029 4.313988 -1.375029
C  -1.67705 3.759168 -0.50403
C  -3.062052 3.885816 -0.601542
H  -3.700995 3.399764 0.125776
C  -3.630885 4.631422 -1.623392
H  -4.70792 4.721974 -1.687203
C  -2.82294 5.264095 -2.560323
H  -3.268077 5.845605 -3.357573
H  1.159448 -1.620066 3.65758
C  -1.056054 2.902457 0.569936
H  -0.546449 1.127749 -0.44256
H  0.002491 3.141659 0.673815
H  -1.521958 3.088562 1.536595
elementType: H C F O N
totalener: -1300.93007940 hartree
nucrepener: 2204.36968042 hartree
electener: -3505.29975981 hartree
oneelecener: -6163.92632205 hartree
twoeener: 2658.62656224 hartree
cpcmener: -0.02816069 hartree
kineticenergy: 1295.78830034 hartree
xcener: -118.325550492592 hartree
chargesum: 0.0000000
charge: 0.141368 -0.201443 -0.101515 0.535989 0.264996 -0.212118 -0.240028 -0.125696 0.142250 0.257376 -0.340699 -0.176854 -0.177307 -0.176719 0.181310 -0.090410 -0.277389 0.081318 0.082844 0.075873 0.101079 0.089185 0.224141 0.121053 -0.518299 -0.145800 0.157750 -0.147551 -0.190059 0.140664 0.016359 -0.198342 0.143764 -0.145794 0.157561 -0.171494 0.157476 0.152156 0.003351 0.180302 0.113691 0.115659
qa: 0.1414 -0.2014 -0.1015 0.5360 0.2650 -0.2121 -0.2400 -0.1257 0.1422 0.2574 -0.3407 -0.1769 -0.1773 -0.1767 0.1813 -0.0904 -0.2774 0.0813 0.0828 0.0759 0.1011 0.0892 0.2241 0.1211 -0.5183 -0.1458 0.1578 -0.1476 -0.1901 0.1407 0.0164 -0.1983 0.1438 -0.1458 0.1576 -0.1715 0.1575 0.1522 0.0034 0.1803 0.1137 0.1157
va: 1.0257 4.0274 3.6503 4.4434 4.0226 1.0781 3.9781 3.8414 1.0145 3.8886 2.0641 1.1206 1.1212 1.1273 3.7735 3.8777 3.9411 1.0214 1.0143 1.0022 1.0058 1.0099 4.1694 1.0126 2.0058 3.1810 0.9902 3.8897 3.9570 1.0031 3.5852 3.8778 1.0255 3.9044 0.9909 3.9125 0.9904 1.0004 3.8154 1.0107 1.0042 1.0211
dispcorr: -0.020758944 hartree
energy: -1300.950838342893
dipole: -43.94436 43.32955 -0.61482 33.06610 -32.31252 0.75358 -11.73790 10.90183 -0.83608
magnitude: 1.28254 au
magnitude: 3.25995 debye
