program: Orca
programVersion: 5.0.2
elementType: H C C C C F C C H C O F F F C C C H H H H H C H O N H C C H C C H C H C H H C H H H
charge: 0
multiplicity: 1
keywords: wb97x-d3
keywords: def2-TZVPP
keywords: def2/J RIJCOSX
keywords: DEFGRID2
keywords: scfconv7
keywords: smallprint printgap noloewdin
keywords: NOSOSCF
formula: C18H17F4NO2
InChI: InChI=1/C18H17F4NO2/c1-2-16(17(24)23-11-12-6-4-3-5-7-12)25-13-8-9-15(19)14(10-13)18(20,21)22/h3-10,16,23H,2,11H2,1H3
42 atoms
H  1.485031 -1.83961 -1.263526
C  1.347375 -1.862771 -0.190413
C  2.402302 -2.162491 0.65537
C  3.770951 -2.452523 0.120389
C  2.177024 -2.176646 2.025406
F  3.189136 -2.46136 2.855789
C  0.936823 -1.901469 2.549021
C  -0.119019 -1.598608 1.699739
H  -1.080991 -1.385995 2.145402
C  0.084692 -1.579985 0.324686
O  -0.868625 -1.306651 -0.595687
F  3.804218 -2.422568 -1.213407
F  4.208221 -3.659585 0.494523
F  4.670657 -1.561937 0.556307
C  -2.146206 -0.866709 -0.168702
C  -3.045729 -0.882764 -1.401183
C  -4.489898 -0.506494 -1.108305
H  -3.012448 -1.894435 -1.812126
H  -2.633065 -0.215969 -2.163299
H  -4.603562 0.542499 -0.834486
H  -4.909321 -1.110888 -0.302321
H  -5.102098 -0.673117 -1.994778
C  -2.098368 0.528507 0.452769
H  -2.562483 -1.547707 0.581767
O  -2.885928 0.829732 1.340399
N  -1.190408 1.361575 -0.067379
H  -4.688811 4.675318 -1.819723
C  -3.61118 4.626585 -1.727044
C  -3.038455 3.770062 -0.79994
H  -3.67477 3.159562 -0.169938
C  -1.652652 3.697491 -0.663635
C  -0.855697 4.500774 -1.471133
H  0.223072 4.45391 -1.374752
C  -1.427236 5.362968 -2.399754
H  -0.79391 5.983538 -3.02117
C  -2.806283 5.426056 -2.530837
H  -3.254493 6.096622 -3.253017
H  0.786455 -1.918837 3.620422
C  -1.031156 2.745112 0.326209
H  -0.623421 1.037472 -0.836898
H  0.035037 2.953213 0.424898
H  -1.471808 2.875938 1.313755
elementType: H C F O N
totalener: -1300.92976976 hartree
nucrepener: 2193.53880345 hartree
electener: -3494.46857321 hartree
oneelecener: -6142.34409959 hartree
twoeener: 2647.87552638 hartree
cpcmener: -0.02863637 hartree
kineticenergy: 1295.78357326 hartree
xcener: -118.322921085157 hartree
chargesum: 0.0000000
charge: 0.139386 -0.200133 -0.096871 0.536463 0.261509 -0.212008 -0.231908 -0.121483 0.139389 0.244434 -0.331966 -0.176759 -0.176552 -0.177130 0.167401 -0.098417 -0.285932 0.084538 0.083306 0.083557 0.090533 0.097009 0.244460 0.117444 -0.513597 -0.153208 0.156648 -0.162572 -0.183504 0.144232 0.009463 -0.190130 0.140630 -0.147267 0.156179 -0.165282 0.157394 0.152763 0.015937 0.175305 0.111028 0.115710
qa: 0.1394 -0.2001 -0.0969 0.5365 0.2615 -0.2120 -0.2319 -0.1215 0.1394 0.2444 -0.3320 -0.1768 -0.1766 -0.1771 0.1674 -0.0984 -0.2859 0.0845 0.0833 0.0836 0.0905 0.0970 0.2445 0.1174 -0.5136 -0.1532 0.1566 -0.1626 -0.1835 0.1442 0.0095 -0.1901 0.1406 -0.1473 0.1562 -0.1653 0.1574 0.1528 0.0159 0.1753 0.1110 0.1157
va: 1.0277 4.0273 3.6468 4.4439 4.0262 1.0780 3.9719 3.8309 1.0209 3.8984 2.0659 1.1273 1.1224 1.1203 3.7780 3.8977 3.9508 1.0152 1.0145 1.0035 1.0030 1.0033 4.1129 1.0093 1.9941 3.1772 0.9926 3.9162 3.9026 1.0175 3.6437 3.9564 1.0038 3.8947 0.9909 3.9051 0.9904 1.0001 3.7969 1.0167 1.0045 1.0229
dispcorr: -0.019973891 hartree
energy: -1300.949743651687
dipole: -48.47381 47.61058 -0.86324 28.65796 -28.02182 0.63614 -12.56391 11.38671 -1.17720
magnitude: 1.59237 au
magnitude: 4.04749 debye
