program: Orca
programVersion: 5.0.2
elementType: H C C C C F C C H C O F F F C C C H H H H H C H O N H C C H C C H C H C H H C H H H
charge: 0
multiplicity: 1
keywords: wb97x-d3
keywords: def2-TZVPP
keywords: def2/J RIJCOSX
keywords: DEFGRID2
keywords: scfconv7
keywords: smallprint printgap noloewdin
keywords: NOSOSCF
formula: C18H17F4NO2
InChI: InChI=1/C18H17F4NO2/c1-2-16(17(24)23-11-12-6-4-3-5-7-12)25-13-8-9-15(19)14(10-13)18(20,21)22/h3-10,16,23H,2,11H2,1H3
42 atoms
H  0.542935 -2.339918 -1.365112
C  0.651026 -1.737106 -0.473163
C  1.904219 -1.364259 -0.015445
C  3.147622 -1.79979 -0.728464
C  1.992235 -0.579726 1.126557
F  3.194921 -0.186775 1.567824
C  0.867814 -0.192681 1.814972
C  -0.385655 -0.579547 1.362815
H  -1.245114 -0.267043 1.938354
C  -0.498572 -1.344758 0.207473
O  -1.665875 -1.763548 -0.33563
F  3.930649 -2.554489 0.053293
F  3.887215 -0.758272 -1.127752
F  2.87283 -2.522707 -1.816266
C  -2.894839 -1.30048 0.20049
C  -4.003464 -2.033452 -0.544823
C  -5.393924 -1.6651 -0.052476
H  -3.84021 -3.104984 -0.408978
H  -3.919506 -1.832657 -1.616063
H  -5.487435 -1.79648 1.026278
H  -6.138193 -2.30535 -0.526082
H  -5.660544 -0.634882 -0.289239
C  -3.022678 0.218568 0.067502
H  -2.964461 -1.538868 1.268028
O  -3.527001 0.882399 0.962362
N  -2.572716 0.735698 -1.083292
H  0.277245 4.076575 2.109806
C  0.255314 3.538712 1.170574
C  -0.964861 3.234702 0.578197
H  -1.886484 3.536544 1.061097
C  -1.012033 2.549996 -0.630784
C  0.184417 2.165187 -1.233657
H  0.163831 1.628252 -2.175476
C  1.402513 2.463833 -0.643614
H  2.323026 2.156207 -1.123139
C  1.440639 3.15289 0.562814
H  2.391031 3.388163 1.024332
H  0.960067 0.413613 2.706015
C  -2.326957 2.155356 -1.254957
H  -2.117378 0.117656 -1.738893
H  -3.150845 2.72229 -0.824375
H  -2.322598 2.361067 -2.325108
elementType: H C F O N
totalener: -1300.92902275 hartree
nucrepener: 2355.79779950 hartree
electener: -3656.72682225 hartree
oneelecener: -6467.45451006 hartree
twoeener: 2810.72768780 hartree
cpcmener: -0.02901248 hartree
kineticenergy: 1295.79531726 hartree
xcener: -118.327119841792 hartree
chargesum: 0.0000000
charge: 0.136279 -0.201726 -0.089210 0.535046 0.266157 -0.214722 -0.242334 -0.141526 0.136339 0.272153 -0.327401 -0.176820 -0.176579 -0.176709 0.169503 -0.106888 -0.283085 0.083939 0.082643 0.090907 0.097381 0.086594 0.231268 0.116921 -0.499046 -0.163236 0.155171 -0.155729 -0.167556 0.138196 0.040677 -0.223260 0.138552 -0.141671 0.152419 -0.164514 0.155321 0.153133 0.001246 0.178520 0.107597 0.126048
qa: 0.1363 -0.2017 -0.0892 0.5350 0.2662 -0.2147 -0.2423 -0.1415 0.1363 0.2722 -0.3274 -0.1768 -0.1766 -0.1767 0.1695 -0.1069 -0.2831 0.0839 0.0826 0.0909 0.0974 0.0866 0.2313 0.1169 -0.4990 -0.1632 0.1552 -0.1557 -0.1676 0.1382 0.0407 -0.2233 0.1386 -0.1417 0.1524 -0.1645 0.1553 0.1531 0.0012 0.1785 0.1076 0.1260
va: 1.0289 4.0235 3.6276 4.4415 3.9778 1.0722 3.9098 3.7832 1.0328 3.8468 2.0713 1.1211 1.1189 1.1273 3.7381 3.9203 3.9413 1.0149 1.0129 1.0029 1.0028 1.0058 4.1474 1.0100 2.0115 3.1681 0.9912 3.8864 3.9089 1.0138 3.5035 3.9067 1.0073 3.8406 0.9977 3.8468 0.9918 1.0006 3.8359 1.0163 1.0164 1.0005
dispcorr: -0.025068665 hartree
energy: -1300.954091415131
dipole: -43.33731 42.12622 -1.21109 12.74303 -12.92236 -0.17933 0.51000 -1.47595 -0.96595
magnitude: 1.55948 au
magnitude: 3.96387 debye
