program: Orca
programVersion: 5.0.2
elementType: H C C C C F C C H C O F F F C C C H H H H H C H O N H C C H C C H C H C H H C H H H
charge: 0
multiplicity: 1
keywords: wb97x-d3
keywords: def2-TZVPP
keywords: def2/J RIJCOSX
keywords: DEFGRID2
keywords: scfconv7
keywords: smallprint printgap noloewdin
keywords: NOSOSCF
formula: C18H17F4NO2
InChI: InChI=1/C18H17F4NO2/c1-2-16(17(24)23-11-12-6-4-3-5-7-12)25-13-8-9-15(19)14(10-13)18(20,21)22/h3-10,16,23H,2,11H2,1H3
42 atoms
H  0.603424 -3.220149 -0.319201
C  0.836485 -2.248032 0.093845
C  2.14966 -1.857568 0.293637
C  3.286808 -2.771764 -0.047191
C  2.399943 -0.597209 0.82061
F  3.66692 -0.20353 1.013192
C  1.373115 0.255262 1.148241
C  0.056701 -0.142385 0.952795
H  -0.725423 0.549091 1.23267
C  -0.216524 -1.395579 0.418296
O  -1.451136 -1.890377 0.188853
F  4.116253 -2.228757 -0.946308
F  2.86059 -3.927058 -0.561253
F  4.024408 -3.072965 1.029358
C  -2.585129 -1.058015 0.317911
C  -3.801116 -1.948548 0.083509
C  -5.127116 -1.23418 0.290733
H  -3.730106 -2.787144 0.780266
H  -3.751098 -2.366206 -0.925091
H  -5.185146 -0.768446 1.275897
H  -5.948529 -1.946678 0.220337
H  -5.307397 -0.462284 -0.457025
C  -2.509828 0.062464 -0.723622
H  -2.640172 -0.641553 1.332408
O  -2.035267 -0.149105 -1.829144
N  -3.018282 1.235136 -0.326805
H  -1.296695 6.122038 1.221252
C  -1.076839 5.260996 0.602911
C  -2.113839 4.463553 0.134415
H  -3.137918 4.70858 0.391824
C  -1.851791 3.352149 -0.659034
C  -0.529275 3.050505 -0.981679
H  -0.307464 2.190581 -1.602438
C  0.507328 3.845435 -0.516112
H  1.529804 3.60223 -0.775991
C  0.236036 4.952522 0.279619
H  1.045907 5.571565 0.643628
H  1.58878 1.232716 1.559056
C  -2.97321 2.452564 -1.112321
H  -3.312587 1.325928 0.63436
H  -3.931373 2.963827 -1.014049
H  -2.860207 2.183336 -2.160853
elementType: H C F O N
totalener: -1300.92808725 hartree
nucrepener: 2245.22485855 hartree
electener: -3546.15294580 hartree
oneelecener: -6246.46156995 hartree
twoeener: 2700.30862415 hartree
cpcmener: -0.03628965 hartree
kineticenergy: 1295.79202648 hartree
xcener: -118.325051016919 hartree
chargesum: 0.0000000
charge: 0.137795 -0.196526 -0.105049 0.535938 0.267388 -0.213521 -0.242180 -0.137570 0.138950 0.269784 -0.311088 -0.177208 -0.176459 -0.177841 0.136031 -0.091266 -0.300997 0.083946 0.083273 0.090245 0.099880 0.086592 0.260924 0.115706 -0.507720 -0.158371 0.157666 -0.149636 -0.190017 0.140230 0.020873 -0.197443 0.145537 -0.164679 0.158029 -0.159546 0.158621 0.151394 0.012026 0.176824 0.113251 0.116214
qa: 0.1378 -0.1965 -0.1050 0.5359 0.2674 -0.2135 -0.2422 -0.1376 0.1390 0.2698 -0.3111 -0.1772 -0.1765 -0.1778 0.1360 -0.0913 -0.3010 0.0839 0.0833 0.0902 0.0999 0.0866 0.2609 0.1157 -0.5077 -0.1584 0.1577 -0.1496 -0.1900 0.1402 0.0209 -0.1974 0.1455 -0.1647 0.1580 -0.1595 0.1586 0.1514 0.0120 0.1768 0.1133 0.1162
va: 1.0290 4.0349 3.6516 4.4436 4.0363 1.0769 3.9537 3.8002 1.0189 3.8833 2.1043 1.1211 1.1272 1.1193 3.8310 3.8773 3.9581 1.0126 1.0181 0.9993 1.0045 1.0059 4.0752 1.0003 2.0047 3.2016 0.9901 3.8955 3.9584 1.0034 3.5941 3.8644 1.0200 3.8842 0.9918 3.8989 0.9894 1.0029 3.8133 1.0047 1.0033 1.0233
dispcorr: -0.021361665 hartree
energy: -1300.949448915165
dipole: -48.69929 45.63698 -3.06230 25.93645 -23.93057 2.00588 1.45258 0.52686 1.97944
magnitude: 4.16166 au
magnitude: 10.57811 debye
