program: Orca
programVersion: 5.0.2
elementType: H C C C C F C C H C O F F F C C C H H H H H C H O N H C C H C C H C H C H H C H H H
charge: 0
multiplicity: 1
keywords: wb97x-d3
keywords: def2-TZVPP
keywords: def2/J RIJCOSX
keywords: DEFGRID2
keywords: scfconv7
keywords: smallprint printgap noloewdin
keywords: NOSOSCF
formula: C18H17F4NO2
InChI: InChI=1/C18H17F4NO2/c1-2-16(17(24)23-11-12-6-4-3-5-7-12)25-13-8-9-15(19)14(10-13)18(20,21)22/h3-10,16,23H,2,11H2,1H3
42 atoms
H  0.393794 -2.138278 -1.157076
C  0.497084 -1.590973 -0.229415
C  1.738894 -1.156911 0.204166
C  2.978387 -1.45074 -0.583674
C  1.821984 -0.443061 1.392307
F  3.013699 -0.001329 1.816301
C  0.702528 -0.175351 2.143128
C  -0.539445 -0.616598 1.710052
H  -1.39865 -0.391595 2.326343
C  -0.647148 -1.319426 0.515643
O  -1.810186 -1.771887 -0.010697
F  2.708018 -2.088976 -1.724032
F  3.826419 -2.225182 0.104494
F  3.645072 -0.336699 -0.910204
C  -3.036686 -1.313043 0.533498
C  -4.165079 -2.078953 -0.147766
C  -4.276974 -1.891025 -1.653038
H  -5.096381 -1.777567 0.336633
H  -4.030406 -3.137496 0.087767
H  -3.351914 -2.144676 -2.171842
H  -4.54693 -0.869596 -1.922193
H  -5.055475 -2.543289 -2.049366
C  -3.192156 0.204095 0.38616
H  -3.085433 -1.532798 1.605627
O  -3.839307 0.833743 1.210694
N  -2.600452 0.745007 -0.685784
H  2.085144 2.078503 -2.183637
C  1.372034 2.349705 -1.415762
C  0.017151 2.145927 -1.62983
H  -0.318288 1.714357 -2.566612
C  -0.917114 2.486413 -0.653579
C  -0.469921 3.047464 0.537972
H  -1.184993 3.31576 1.306891
C  0.886059 3.264119 0.750449
H  1.220928 3.70564 1.68059
C  1.810579 2.908241 -0.221489
H  2.867572 3.071148 -0.053967
H  0.790827 0.381247 3.066673
C  -2.374657 2.166216 -0.86949
H  -2.096628 0.133896 -1.311459
H  -3.005059 2.714442 -0.172435
H  -2.685343 2.446574 -1.877452
elementType: H C F O N
totalener: -1300.92737042 hartree
nucrepener: 2378.40773587 hartree
electener: -3679.33510629 hartree
oneelecener: -6512.46057682 hartree
twoeener: 2833.12547053 hartree
cpcmener: -0.02907012 hartree
kineticenergy: 1295.79184798 hartree
xcener: -118.327547271169 hartree
chargesum: 0.0000000
charge: 0.136440 -0.190529 -0.089213 0.540553 0.264647 -0.215225 -0.238371 -0.112420 0.138792 0.230152 -0.334175 -0.177599 -0.176756 -0.175815 0.174832 -0.099910 -0.288246 0.082375 0.084846 0.089306 0.083626 0.101825 0.212956 0.119219 -0.507770 -0.148795 0.154146 -0.162038 -0.209221 0.142704 0.032555 -0.184538 0.140560 -0.148059 0.155686 -0.149890 0.156101 0.153814 0.011143 0.181141 0.100765 0.120387
qa: 0.1364 -0.1905 -0.0892 0.5406 0.2646 -0.2152 -0.2384 -0.1124 0.1388 0.2302 -0.3342 -0.1776 -0.1768 -0.1758 0.1748 -0.0999 -0.2882 0.0824 0.0848 0.0893 0.0836 0.1018 0.2130 0.1192 -0.5078 -0.1488 0.1541 -0.1620 -0.2092 0.1427 0.0326 -0.1845 0.1406 -0.1481 0.1557 -0.1499 0.1561 0.1538 0.0111 0.1811 0.1008 0.1204
va: 1.0275 3.9895 3.5907 4.4328 3.9442 1.0675 3.9338 3.7802 1.0220 3.8629 2.0704 1.1264 1.1215 1.1186 3.7360 3.8943 3.9298 1.0151 1.0118 1.0093 1.0078 1.0049 4.2020 1.0104 2.0164 3.1765 0.9960 3.8460 3.8932 1.0029 3.5652 3.8831 1.0072 3.8395 0.9910 3.8291 0.9909 1.0006 3.8121 1.0068 1.0334 0.9990
dispcorr: -0.025428061 hartree
energy: -1300.952798483093
dipole: -39.10871 38.18549 -0.92322 9.34044 -9.59988 -0.25944 -4.07431 3.28454 -0.78977
magnitude: 1.24233 au
magnitude: 3.15775 debye
