program: Orca
programVersion: 5.0.2
elementType: H C C C C F C C H C O F F F C C C H H H H H C H O N H C C H C C H C H C H H C H H H
charge: 0
multiplicity: 1
keywords: wb97x-d3
keywords: def2-TZVPP
keywords: def2/J RIJCOSX
keywords: DEFGRID2
keywords: scfconv7
keywords: smallprint printgap noloewdin
keywords: NOSOSCF
formula: C18H17F4NO2
InChI: InChI=1/C18H17F4NO2/c1-2-16(17(24)23-11-12-6-4-3-5-7-12)25-13-8-9-15(19)14(10-13)18(20,21)22/h3-10,16,23H,2,11H2,1H3
42 atoms
H  0.337345 -2.400815 -1.123706
C  0.509552 -1.734569 -0.288873
C  1.789626 -1.304042 0.023924
C  2.972254 -1.730206 -0.792332
C  1.959826 -0.435482 1.093125
F  3.185305 0.024107 1.380497
C  0.893112 -0.02289 1.855815
C  -0.385859 -0.459773 1.544256
H  -1.20226 -0.114606 2.163144
C  -0.583754 -1.3096 0.461225
O  -1.791687 -1.772545 0.055678
F  2.644339 -2.635447 -1.716525
F  3.93477 -2.276596 -0.041494
F  3.528359 -0.695548 -1.437669
C  -2.966754 -1.182698 0.587492
C  -4.164851 -1.97808 0.081573
C  -4.357871 -2.00041 -1.427171
H  -5.05177 -1.561946 0.564535
H  -4.06492 -2.99793 0.460883
H  -3.485179 -2.39187 -1.950724
H  -4.578134 -1.011399 -1.829515
H  -5.200138 -2.644266 -1.681285
C  -3.066179 0.303333 0.233357
H  -2.965084 -1.244926 1.680993
O  -3.623958 1.076718 0.99895
N  -2.531088 0.667585 -0.939724
H  0.331574 4.203843 1.941067
C  0.312808 3.610799 1.035382
C  -0.905709 3.257462 0.468083
H  -1.829326 3.577264 0.935733
C  -0.948297 2.500482 -0.698034
C  0.250625 2.094253 -1.281058
H  0.232142 1.501559 -2.188978
C  1.467661 2.443126 -0.715616
H  2.390323 2.119823 -1.180531
C  1.50127 3.204115 0.446514
H  2.450191 3.477281 0.890199
H  1.049932 0.648878 2.688995
C  -2.261044 2.050041 -1.28847
H  -2.062839 -0.03284 -1.494473
H  -3.082254 2.678473 -0.9482
H  -2.236447 2.116661 -2.375939
elementType: H C F O N
totalener: -1300.92797646 hartree
nucrepener: 2375.95735757 hartree
electener: -3676.88533403 hartree
oneelecener: -6507.56743657 hartree
twoeener: 2830.68210254 hartree
cpcmener: -0.02857432 hartree
kineticenergy: 1295.78498878 hartree
xcener: -118.327034543164 hartree
chargesum: 0.0000000
charge: 0.137745 -0.186447 -0.081121 0.534465 0.256025 -0.214552 -0.221564 -0.145419 0.136661 0.244429 -0.335221 -0.176631 -0.176543 -0.175669 0.186274 -0.099473 -0.288210 0.081664 0.084720 0.089354 0.083071 0.101139 0.215456 0.118700 -0.504780 -0.155644 0.155047 -0.154012 -0.166826 0.137763 0.037036 -0.225379 0.139323 -0.124019 0.152217 -0.174817 0.154091 0.152961 -0.008697 0.183768 0.109826 0.123291
qa: 0.1377 -0.1864 -0.0811 0.5345 0.2560 -0.2146 -0.2216 -0.1454 0.1367 0.2444 -0.3352 -0.1766 -0.1765 -0.1757 0.1863 -0.0995 -0.2882 0.0817 0.0847 0.0894 0.0831 0.1011 0.2155 0.1187 -0.5048 -0.1556 0.1550 -0.1540 -0.1668 0.1378 0.0370 -0.2254 0.1393 -0.1240 0.1522 -0.1748 0.1541 0.1530 -0.0087 0.1838 0.1098 0.1233
va: 1.0264 4.0079 3.6177 4.4436 3.9741 1.0706 3.8973 3.8118 1.0257 3.8614 2.0728 1.1273 1.1236 1.1159 3.7323 3.8957 3.9307 1.0147 1.0117 1.0087 1.0096 1.0050 4.1896 1.0106 2.0161 3.1693 0.9912 3.8861 3.9034 1.0158 3.5308 3.9014 1.0061 3.8175 0.9994 3.8604 0.9931 0.9997 3.8388 1.0065 1.0177 1.0017
dispcorr: -0.025874356 hartree
energy: -1300.953850814447
dipole: -39.77107 38.76082 -1.01024 11.21209 -11.56559 -0.35350 -0.91472 0.25898 -0.65574
magnitude: 1.25521 au
magnitude: 3.19048 debye
