program: Orca
programVersion: 5.0.2
elementType: H C C C C F C C H C O F F F C C C H H H H H C H O N H C C H C C H C H C H H C H H H
charge: 0
multiplicity: 1
keywords: wb97x-d3
keywords: def2-TZVPP
keywords: def2/J RIJCOSX
keywords: DEFGRID2
keywords: scfconv7
keywords: smallprint printgap noloewdin
keywords: NOSOSCF
formula: C18H17F4NO2
InChI: InChI=1/C18H17F4NO2/c1-2-16(17(24)23-11-12-6-4-3-5-7-12)25-13-8-9-15(19)14(10-13)18(20,21)22/h3-10,16,23H,2,11H2,1H3
42 atoms
H  0.310237 -2.335365 -1.29357
C  0.460255 -1.69046 -0.43848
C  1.736192 -1.293524 -0.068921
C  2.934022 -1.707564 -0.874125
C  1.879837 -0.459184 1.030826
F  3.092779 -0.024507 1.382654
C  0.788163 -0.044932 1.757598
C  -0.485098 -0.442578 1.384788
H  -1.320861 -0.078338 1.964846
C  -0.654691 -1.260481 0.273799
O  -1.855714 -1.673574 -0.203673
F  2.613279 -2.611346 -1.804648
F  3.892885 -2.246054 -0.121681
F  3.473761 -0.662096 -1.514692
C  -3.03087 -1.060378 0.293193
C  -4.224294 -1.740292 -0.362687
C  -4.344709 -3.215036 -0.007904
H  -4.166581 -1.613081 -1.44683
H  -5.119214 -1.205768 -0.036787
H  -5.233825 -3.646681 -0.46618
H  -4.430546 -3.356144 1.070061
H  -3.484421 -3.785909 -0.352388
C  -3.039625 0.448856 0.023771
H  -3.108099 -1.188489 1.379922
O  -3.537521 1.219351 0.816514
N  -2.493702 0.820488 -1.1549
H  0.321417 4.072733 2.098635
C  0.345531 3.526668 1.164446
C  -0.841264 3.244746 0.502012
H  -1.786244 3.557819 0.927204
C  -0.828116 2.554868 -0.704311
C  0.393354 2.140256 -1.227605
H  0.423062 1.600135 -2.167545
C  1.578907 2.413465 -0.565542
H  2.518972 2.077621 -0.982483
C  1.556952 3.111773 0.633687
H  2.482328 3.329195 1.150514
H  0.926472 0.613315 2.603397
C  -2.114661 2.198057 -1.40628
H  -2.007673 0.11523 -1.683691
H  -2.927541 2.847298 -1.084803
H  -2.012693 2.323536 -2.485303
totalener: -1300.90489643 hartree
nucrepener: 2379.30072720 hartree
electener: -3680.20562363 hartree
oneelecener: -6513.98077926 hartree
twoeener: 2833.77515563 hartree
kineticenergy: 1295.84737673 hartree
xcener: -118.333138196621 hartree
chargesum: 0.0000000
charge: 0.131558 -0.205714 -0.077360 0.533268 0.228363 -0.194158 -0.183186 -0.126022 0.119389 0.246283 -0.315101 -0.173267 -0.161746 -0.168756 0.140463 -0.122307 -0.255897 0.071873 0.090040 0.088350 0.072874 0.090518 0.216577 0.098540 -0.383370 -0.172603 0.128500 -0.133780 -0.120797 0.123102 0.061398 -0.197959 0.107688 -0.106963 0.136844 -0.155005 0.130640 0.126704 -0.058133 0.143354 0.109131 0.116667
qa: 0.1316 -0.2057 -0.0774 0.5333 0.2284 -0.1942 -0.1832 -0.1260 0.1194 0.2463 -0.3151 -0.1733 -0.1617 -0.1688 0.1405 -0.1223 -0.2559 0.0719 0.0900 0.0884 0.0729 0.0905 0.2166 0.0985 -0.3834 -0.1726 0.1285 -0.1338 -0.1208 0.1231 0.0614 -0.1980 0.1077 -0.1070 0.1368 -0.1550 0.1306 0.1267 -0.0581 0.1434 0.1091 0.1167
va: 1.0291 4.0249 3.6571 4.4454 4.0518 1.0998 3.9199 3.8617 1.0344 3.8599 2.0720 1.1295 1.1463 1.1240 3.7742 3.9046 3.9440 1.0176 1.0153 1.0061 1.0045 1.0100 4.1807 1.0120 2.1352 3.1346 0.9987 3.9138 3.9451 1.0219 3.5127 3.9463 1.0124 3.8811 1.0058 3.9100 1.0013 1.0091 3.8968 1.0414 1.0178 0.9989
dispcorr: -0.025930702 hartree
energy: -1300.930827129620
dipole: -39.17379 38.31511 -0.85868 8.84266 -8.94672 -0.10406 2.16958 -2.50564 -0.33606
magnitude: 0.92795 au
magnitude: 2.35867 debye
