program: Orca
programVersion: 5.0.2
elementType: H C C C C F C C H C O F F F C C C H H H H H C H O N H C C H C C H C H C H H C H H H
charge: 0
multiplicity: 1
keywords: wb97x-d3
keywords: def2-TZVPP
keywords: def2/J RIJCOSX
keywords: DEFGRID2
keywords: scfconv7
keywords: smallprint printgap noloewdin
keywords: NOSOSCF
formula: C18H17F4NO2
InChI: InChI=1/C18H17F4NO2/c1-2-16(17(24)23-11-12-6-4-3-5-7-12)25-13-8-9-15(19)14(10-13)18(20,21)22/h3-10,16,23H,2,11H2,1H3
42 atoms
H  0.312378 -2.305827 -1.333583
C  0.458625 -1.673673 -0.468527
C  1.733314 -1.308248 -0.068803
C  2.941565 -1.77062 -0.825971
C  1.875476 -0.489655 1.042659
F  3.091873 -0.095656 1.428185
C  0.780201 -0.05733 1.751268
C  -0.4936 -0.427919 1.352726
H  -1.330705 -0.05637 1.925717
C  -0.659337 -1.23042 0.229972
O  -1.857172 -1.620681 -0.27153
F  2.60837 -2.541048 -1.865733
F  3.76565 -2.485135 -0.057552
F  3.639789 -0.738268 -1.312122
C  -3.037699 -1.072881 0.282816
C  -4.220716 -1.756068 -0.387756
C  -4.253374 -3.259361 -0.151265
H  -4.208453 -1.540735 -1.459481
H  -5.127784 -1.295147 0.009108
H  -4.276063 -3.492911 0.914111
H  -3.385529 -3.755264 -0.582578
H  -5.143214 -3.697613 -0.601848
C  -3.092138 0.44882 0.099295
H  -3.08447 -1.265078 1.361997
O  -3.583805 1.162718 0.947086
N  -2.583868 0.894877 -1.070926
H  2.426164 1.980936 -1.211174
C  1.536972 2.347008 -0.715115
C  0.291525 2.131122 -1.280637
H  0.222822 1.605838 -2.227143
C  -0.866209 2.583627 -0.653006
C  -0.752767 3.255139 0.557695
H  -1.647051 3.59607 1.064213
C  0.495281 3.484069 1.122078
H  0.570183 4.016327 2.061528
C  1.641452 3.029983 0.488881
H  2.614179 3.20324 0.929864
H  0.917003 0.588523 2.606742
C  -2.217196 2.286001 -1.25537
H  -2.100814 0.224872 -1.646854
H  -2.989929 2.909798 -0.80972
H  -2.215382 2.494299 -2.326627
totalener: -1300.90510034 hartree
nucrepener: 2376.62325893 hartree
electener: -3677.52835927 hartree
oneelecener: -6508.59689036 hartree
twoeener: 2831.06853109 hartree
kineticenergy: 1295.85887500 hartree
xcener: -118.335295858486 hartree
chargesum: 0.0000000
charge: 0.130698 -0.209941 -0.083825 0.534572 0.236667 -0.195037 -0.192651 -0.128240 0.120367 0.261544 -0.315377 -0.174055 -0.162648 -0.167898 0.134122 -0.120054 -0.254317 0.071589 0.088809 0.073576 0.089493 0.088351 0.213804 0.101478 -0.381467 -0.171275 0.133877 -0.115185 -0.196299 0.106579 0.059152 -0.120828 0.122258 -0.138602 0.128608 -0.141446 0.131377 0.126588 -0.052907 0.142250 0.107616 0.118679
qa: 0.1307 -0.2099 -0.0838 0.5346 0.2367 -0.1950 -0.1927 -0.1282 0.1204 0.2615 -0.3154 -0.1741 -0.1626 -0.1679 0.1341 -0.1201 -0.2543 0.0716 0.0888 0.0736 0.0895 0.0884 0.2138 0.1015 -0.3815 -0.1713 0.1339 -0.1152 -0.1963 0.1066 0.0592 -0.1208 0.1223 -0.1386 0.1286 -0.1414 0.1314 0.1266 -0.0529 0.1423 0.1076 0.1187
va: 1.0293 4.0310 3.6560 4.4427 4.0447 1.0999 3.9301 3.8537 1.0376 3.8427 2.0687 1.1288 1.1434 1.1286 3.7744 3.9051 3.9442 1.0172 1.0152 1.0044 1.0104 1.0062 4.1898 1.0123 2.1365 3.1411 1.0068 3.9037 3.9448 1.0124 3.5294 3.9398 1.0181 3.9128 0.9988 3.8925 1.0010 1.0091 3.8878 1.0427 1.0211 0.9977
dispcorr: -0.025812918 hartree
energy: -1300.930913254561
dipole: -39.02628 38.17441 -0.85187 9.28949 -9.31241 -0.02293 1.34695 -1.75954 -0.41260
magnitude: 0.94681 au
magnitude: 2.40660 debye
