program: Orca
programVersion: 5.0.2
elementType: H C C C C F C C H C O F F F C C C H H H H H C H O N H C C H C C H C H C H H C H H H
charge: 0
multiplicity: 1
keywords: wb97x-d3
keywords: def2-TZVPP
keywords: def2/J RIJCOSX
keywords: DEFGRID2
keywords: scfconv7
keywords: smallprint printgap noloewdin
keywords: NOSOSCF
formula: C18H17F4NO2
InChI: InChI=1/C18H17F4NO2/c1-2-16(17(24)23-11-12-6-4-3-5-7-12)25-13-8-9-15(19)14(10-13)18(20,21)22/h3-10,16,23H,2,11H2,1H3
42 atoms
H  0.669776 -1.45791 -1.535173
C  0.66916 -1.431495 -0.454303
C  1.855982 -1.309521 0.248363
C  3.172423 -1.192319 -0.463909
C  1.810582 -1.275703 1.63679
F  2.943095 -1.170832 2.334596
C  0.612735 -1.342708 2.309252
C  -0.575699 -1.458338 1.601604
H  -1.50008 -1.494914 2.16041
C  -0.550768 -1.510231 0.212822
O  -1.64642 -1.627372 -0.573418
F  4.006839 -2.178532 -0.136015
F  3.786391 -0.040912 -0.166305
F  3.021133 -1.224932 -1.789654
C  -2.922987 -1.41025 0.001225
C  -3.956729 -1.710473 -1.078324
C  -5.388995 -1.5930 -0.576232
H  -3.774216 -2.725049 -1.439771
H  -3.801239 -1.044569 -1.931276
H  -5.642414 -0.577074 -0.277484
H  -5.564799 -2.238971 0.284287
H  -6.08605 -1.88982 -1.358638
C  -3.059471 0.01994 0.537216
H  -3.094042 -2.086959 0.846845
O  -3.654917 0.249825 1.568767
N  -2.49091 0.960711 -0.241945
H  2.2790 2.195172 0.039948
C  1.382996 2.719364 -0.263184
C  0.143087 2.240468 0.125546
H  0.082928 1.34802 0.737538
C  -1.023945 2.892359 -0.268309
C  -0.921579 4.036056 -1.049604
H  -1.821346 4.54933 -1.367957
C  0.320413 4.524816 -1.431618
H  0.383038 5.416193 -2.041905
C  1.474881 3.864834 -1.04276
H  2.443837 4.237327 -1.34763
H  0.602708 -1.303289 3.389897
C  -2.371465 2.352149 0.133244
H  -2.012094 0.670559 -1.079233
H  -2.515263 2.420417 1.212811
H  -3.16614 2.947634 -0.326053
totalener: -1300.90576620 hartree
nucrepener: 2310.10709551 hartree
electener: -3611.01286171 hartree
oneelecener: -6375.20908700 hartree
twoeener: 2764.19622529 hartree
kineticenergy: 1295.83008517 hartree
xcener: -118.328939876849 hartree
chargesum: 0.0000000
charge: 0.126863 -0.182185 -0.140985 0.543683 0.271796 -0.188763 -0.207410 -0.110552 0.122263 0.221703 -0.304305 -0.161355 -0.168255 -0.172667 0.116584 -0.111059 -0.252669 0.081545 0.071281 0.091619 0.082681 0.088728 0.213216 0.106146 -0.382259 -0.187829 0.135689 -0.122341 -0.144905 0.109406 -0.033896 -0.124047 0.109521 -0.122315 0.126180 -0.129454 0.128338 0.130088 0.019242 0.147937 0.116339 0.086404
qa: 0.1269 -0.1822 -0.1410 0.5437 0.2718 -0.1888 -0.2074 -0.1106 0.1223 0.2217 -0.3043 -0.1614 -0.1683 -0.1727 0.1166 -0.1111 -0.2527 0.0815 0.0713 0.0916 0.0827 0.0887 0.2132 0.1061 -0.3823 -0.1878 0.1357 -0.1223 -0.1449 0.1094 -0.0339 -0.1240 0.1095 -0.1223 0.1262 -0.1295 0.1283 0.1301 0.0192 0.1479 0.1163 0.0864
va: 1.0333 3.9698 3.6768 4.4239 4.0442 1.1115 3.9862 3.8185 1.0318 3.9119 2.0848 1.1466 1.1254 1.1316 3.8265 3.9257 3.9451 1.0163 1.0152 1.0097 1.0057 1.0022 4.1220 1.0068 2.1362 3.1337 1.0092 3.9351 3.9279 1.0206 3.7418 3.9644 1.0124 3.9708 1.0002 3.9798 1.0004 1.0089 3.8122 1.0382 1.0183 1.0043
dispcorr: -0.022870166 hartree
energy: -1300.928636368307
dipole: -43.23532 42.32557 -0.90975 12.19395 -12.08991 0.10404 -4.52117 3.78299 -0.73818
magnitude: 1.17617 au
magnitude: 2.98959 debye
