program: Orca
programVersion: 5.0.2
elementType: H C C C C F C C H C O F F F C C C H H H H H C H O N H C C H C C H C H C H H C H H H
charge: 0
multiplicity: 1
keywords: wb97x-d3
keywords: def2-TZVPP
keywords: def2/J RIJCOSX
keywords: DEFGRID2
keywords: scfconv7
keywords: smallprint printgap noloewdin
keywords: NOSOSCF
formula: C18H17F4NO2
InChI: InChI=1/C18H17F4NO2/c1-2-16(17(24)23-11-12-6-4-3-5-7-12)25-13-8-9-15(19)14(10-13)18(20,21)22/h3-10,16,23H,2,11H2,1H3
42 atoms
H  0.505322 -2.365519 -1.40466
C  0.620824 -1.739088 -0.530845
C  1.879355 -1.34643 -0.105317
C  3.112986 -1.782408 -0.839001
C  1.980646 -0.53844 1.01871
F  3.18026 -0.122596 1.434196
C  0.861671 -0.142501 1.712028
C  -0.395575 -0.541706 1.288307
H  -1.2517 -0.200595 1.852156
C  -0.520665 -1.335869 0.154591
O  -1.697566 -1.761145 -0.368439
F  3.905543 -2.534447 -0.071543
F  3.835046 -0.737266 -1.254708
F  2.812443 -2.506559 -1.921834
C  -2.9091 -1.287433 0.190105
C  -4.041644 -2.02104 -0.518979
C  -5.4146 -1.689031 0.047555
H  -3.852539 -3.092676 -0.42327
H  -4.010498 -1.793196 -1.587666
H  -6.17732 -2.29349 -0.441452
H  -5.681768 -0.643254 -0.095925
H  -5.46601 -1.895175 1.116889
C  -3.034564 0.233614 0.048681
H  -2.956969 -1.511699 1.26289
O  -3.546671 0.904561 0.9199
N  -2.560494 0.733909 -1.114017
H  2.381372 2.167299 -1.072015
C  1.452913 2.441586 -0.588421
C  0.244626 2.176601 -1.211286
H  0.242744 1.70623 -2.188618
C  -0.961225 2.509036 -0.599953
C  -0.934985 3.112432 0.651456
H  -1.866959 3.359871 1.143815
C  0.274655 3.391409 1.273133
H  0.281328 3.870558 2.24365
C  1.469862 3.054991 0.656798
H  2.413095 3.266909 1.142784
H  0.966274 0.495588 2.577774
C  -2.268301 2.147764 -1.260264
H  -2.046153 0.105032 -1.709183
H  -3.092239 2.718874 -0.835737
H  -2.237725 2.374268 -2.327198
totalener: -1300.90482586 hartree
nucrepener: 2368.07777352 hartree
electener: -3668.98259937 hartree
oneelecener: -6491.57709958 hartree
twoeener: 2822.59450020 hartree
kineticenergy: 1295.84348338 hartree
xcener: -118.332544726055 hartree
chargesum: 0.0000000
charge: 0.130612 -0.206575 -0.087855 0.533383 0.240758 -0.195242 -0.203902 -0.123301 0.120586 0.248054 -0.305380 -0.163323 -0.167630 -0.174374 0.130646 -0.110083 -0.252919 0.080150 0.071436 0.088633 0.091440 0.081347 0.203012 0.104162 -0.379635 -0.166131 0.133147 -0.111701 -0.197911 0.106739 0.065854 -0.123822 0.123261 -0.137399 0.129317 -0.145906 0.131746 0.125805 -0.054243 0.141979 0.107220 0.118044
qa: 0.1306 -0.2066 -0.0879 0.5334 0.2408 -0.1952 -0.2039 -0.1233 0.1206 0.2481 -0.3054 -0.1633 -0.1676 -0.1744 0.1306 -0.1101 -0.2529 0.0802 0.0714 0.0886 0.0914 0.0813 0.2030 0.1042 -0.3796 -0.1661 0.1331 -0.1117 -0.1979 0.1067 0.0659 -0.1238 0.1233 -0.1374 0.1293 -0.1459 0.1317 0.1258 -0.0542 0.1420 0.1072 0.1180
va: 1.0306 4.0293 3.6682 4.4457 4.0493 1.1001 3.9289 3.8253 1.0381 3.8817 2.0870 1.1414 1.1315 1.1284 3.7978 3.9259 3.9443 1.0161 1.0165 1.0024 1.0095 1.0060 4.1547 1.0108 2.1364 3.1332 1.0041 3.9063 3.9551 1.0118 3.5112 3.9383 1.0205 3.9120 0.9985 3.8933 1.0003 1.0099 3.8935 1.0432 1.0197 0.9982
dispcorr: -0.025679857 hartree
energy: -1300.930505714752
dipole: -42.90199 41.95354 -0.94845 12.35658 -12.31720 0.03937 1.85824 -2.28099 -0.42275
magnitude: 1.03915 au
magnitude: 2.64131 debye
