program: Gaussian 09
title: 000057637
version: EM64L-G09RevD.01
frameworkgroup: C1[X(C7H11NO6P2)]
method: RPBEPBE
basis: SDD
operation: Freq
keyword: #p
keyword: freq=noraman
keyword: PBEPBE/SDD
title: #p freq=noraman PBEPBE/SDD
converged: YES YES NO NO
title: Mulliken charges:
elementType: P P O O O O O O N C C C C C C C H H H H H H H H H H H
charge: 1.332683 1.313587 -0.705893 -0.777900 -0.660794 -0.673556 -0.576835 -0.619928 -0.308967 -0.969931 -0.526494 0.387955 -0.331969 -0.159474 -0.259393 -0.161752 0.369471 0.294128 0.287557 0.269068 0.434979 0.419446 0.397807 0.444928 0.258182 0.273012 0.250085
chargesum: 0.00000
title: Mulliken charges with hydrogens summed into heavy atoms:
elementType: P P O O O O O O N C C C C C C C
charge: 1.332683 1.313587 -0.270915 -0.358454 -0.262988 -0.228629 -0.576835 -0.619928 -0.308967 -0.600460 0.055191 0.387955 -0.062901 0.098708 0.013620 0.088333
polarizability: 1.85916623e+02 1.69595291e+00 1.53934198e+02 -6.98604145e+00 2.32582379e+00 9.87870345e+01
1716.lowfreq: -10.8394 -3.8294 -0.0007 -0.0002 0.0017 4.6518 18.1473 26.5726 62.2224
frequency: 16.6067 26.5450 62.1898 80.0962 95.7348 145.8327 166.5082 172.5206 188.4764 208.4374 224.0990 245.2527 272.8681 293.8621 307.4110 328.2566 335.2903 357.8397 370.9873 374.8231 407.4269 414.7185 443.5056 513.1163 569.8021 597.4557 655.9265 660.1134 684.5089 708.2762 756.3458 774.6474 792.0807 809.4147 825.1026 852.8236 908.1373 942.6984 970.7893 990.3587 999.7219 1013.0907 1018.7503 1027.4455 1041.5882 1043.4925 1066.4395 1106.5464 1165.6700 1175.0452 1188.8831 1218.9066 1233.7188 1261.2591 1294.6616 1332.5174 1335.4342 1371.4489 1373.7747 1431.2755 1458.6542 1469.9752 1561.3574 1602.0792 1628.3544 2867.8719 2997.6217 3045.8418 3058.5628 3154.6284 3165.7408 3175.1177 3190.1591 3604.9050 3644.1641
redmass: 11.1811 7.9058 4.6525 5.2632 6.1443 2.7786 2.4008 2.9189 5.7965 5.6351 5.8592 2.4055 3.3749 3.7613 5.3427 6.4011 5.5457 7.3110 3.9836 6.4892 3.7719 3.9648 4.2471 3.4507 6.7838 6.5374 6.5627 7.2914 7.0807 4.4564 2.8954 1.5457 8.2364 4.2925 1.3166 3.9549 1.3588 1.8763 1.4417 1.2492 1.4063 1.3990 3.2429 5.7614 4.3603 3.0358 8.0394 1.6245 1.1616 1.0752 1.1850 1.6860 1.2690 1.3107 1.4590 1.3896 2.3404 1.2629 1.2769 1.9367 1.5235 1.3473 3.1349 3.5773 1.6286 1.0696 1.0599 1.0850 1.1006 1.0883 1.0911 1.0967 1.1018 1.0663 1.0663
irintensity: 1.9978 2.5502 6.5941 0.5887 10.1343 21.2511 35.4843 14.5439 2.7121 1.3508 14.6830 35.8051 34.8423 52.5129 2.0017 31.5581 64.4610 94.1604 167.6646 66.9179 6.8620 4.7982 10.9888 20.2697 52.7214 45.3618 46.1059 52.7032 53.2637 99.8534 3.4130 100.7961 179.2471 66.3121 260.9113 41.4513 1.5367 3.6129 1.2862 198.8811 51.6945 1.4710 2.9550 8.0589 142.9451 42.0595 263.6560 23.4223 35.1326 0.5426 23.9260 304.4738 361.9144 18.2138 901.7405 1061.8848 20.9542 74.9890 311.8651 35.9537 32.6284 142.9050 49.0065 24.0828 459.6969 677.9496 9.5014 2.5060 1.0232 3.4418 0.9283 3.7436 7.6523 65.9182 80.8209
temp: 298.150 k
press: 1.00000 atm
elementType: 15 15 8 8 8 8 8 8 7 6 6 6 6 6 6 6 1 1 1 1 1 1 1 1 1 1 1
symmnumber: 1
zpe: 489724.8 jmol-1
zpe.correction: 0.186526 hartree
zpe.thermalcorrener: 0.203562 hartree
zpe.thermalcorrenthalpy: 0.204506 hartree
zpe.thermalcorrgfe: 0.140407 hartree
zpe.sumelectzpe: -1460.681079 hartree
zpe.sumelectthermal: -1460.664044 hartree
zpe.sumelectthermalent: -1460.663099 hartree
zpe.sumelectthermalfe: -1460.727198 hartree
dipole: -8.3822 -0.9458 -1.0371
dipole: 8.4989
quadrupole: -79.8616 -121.8592 -114.9480
quadrupole: 9.7348 -2.5665 -13.3177
quadrupole: 25.6947 -16.3029 -9.3917 9.7348 -2.5665 -13.3177
hfenergy: -1460.8676053 hartree
pointgroup: C01 [X(C7H11N1O6P2)]
dipole: -3.2166182 -0.1343942 0.9032772 debye
polarizability: 186.0434646|2.8658807|147.5639366|-5.9086492|17.7320879|105.0304542 unknown
InChI: InChI=1S/C7H11NO6P2/c9-15(10,11)7-5-6-3-1-2-4-8(6)17-14-16(7,12)13/h1-4,7,9-10,12H,5H2
charge 0 multiplicity 1
27 atoms
P  1.373121 -1.337444 -1.02356
P  2.488783 1.58316 -0.163097
O  0.179104 -2.288733 -0.346377
O  2.745354 -1.64397 0.074087
O  2.921596 1.837297 -1.817361
O  3.734913 0.659614 0.535187
O  1.75408 -1.548851 -2.549057
O  2.11669 2.890424 0.666111
N  -1.828966 -0.903611 0.109913
C  0.990154 0.447663 -0.45755
C  0.084392 0.508857 0.810489
C  -1.397864 0.329523 0.533632
C  -2.333771 1.374031 0.716493
C  -3.702691 1.137146 0.459933
C  -3.144216 -1.143616 -0.144697
C  -4.11951 -0.141736 0.023101
H  0.483677 0.918372 -1.321576
H  0.420426 -0.250322 1.541516
H  0.229309 1.502051 1.274432
H  -1.983603 2.354168 1.052124
H  -0.825928 -1.757128 -0.127335
H  3.005633 -2.591759 0.163632
H  3.757739 2.347776 -1.962263
H  3.563418 -0.353255 0.435384
H  -4.434274 1.939623 0.597473
H  -3.396487 -2.15108 -0.487356
H  -5.16988 -0.359897 -0.186376
